BDBM50571447 CHEMBL4872413
SMILES COc1ccc2Sc3c(Cc2c1)cccc3-c1cc(cc(=O)n1C)N1CCOCC1
InChI Key InChIKey=RMKVYOXYSCXKMS-UHFFFAOYSA-N
Data  2 KI  1 IC50
  Tab Delimited (TSV)   2D SDfile   Computed 3D by Vconf -m prep SDfile
Find this compound or compounds like it in BindingDB:
Activity Spreadsheet -- Enzyme Inhibition Constant Data from BindingDB
Found 3 hits for monomerid = 50571447
TargetPhosphatidylinositol 3-kinase catalytic subunit type 3(Homo sapiens (Human))
Charles River
Curated by ChEMBL
LigandPNGBDBM50571447(CHEMBL4872413)
Affinity DataKi:  910nM. Assay description: Inhibition of full length recombinant GST-tagged human VPS34 expressed in baculovirus expression system using PI/PS as substrate incubated for 60 min...
Ligand InfoPC cidPC sid
In DepthDetails ArticlePubMed
TargetSerine-protein kinase ATM(Homo sapiens (Human))
Charles River
Curated by ChEMBL
LigandPNGBDBM50571447(CHEMBL4872413)
Affinity DataKi: >1.20E+3nM. Assay description: Inhibition of full length recombinant FLAG-tagged human ATM assessed as decrease in p53 S15 phosphorylation using full length myc-tagged p53 as subst...
Ligand InfoPC cidPC sid
In DepthDetails ArticlePubMed
TargetSerine-protein kinase ATM(Homo sapiens (Human))
Charles River
Curated by ChEMBL
LigandPNGBDBM50571447(CHEMBL4872413)
Affinity DataIC50: >3.00E+4nM. Assay description: Inhibition of ATM in human U2OS cells assessed as reduction in etoposide-stimulated KAP1 phosphorylation incubated for 60 mins by immunoreactivity as...
Ligand InfoPC cidPC sid
In DepthDetails ArticlePubMed