BDBM50571448 CHEMBL4872482
SMILES COc1ccc2Sc3c(Cc2c1)cccc3-c1cc(=O)cc([nH]1)N1CCOCC1
InChI Key InChIKey=VLHOFEKDBPRRKV-UHFFFAOYSA-N
Data  1 KI  1 IC50
  Tab Delimited (TSV)   2D SDfile   Computed 3D by Vconf -m prep SDfile
Find this compound or compounds like it in BindingDB:
Activity Spreadsheet -- Enzyme Inhibition Constant Data from BindingDB
Found 2 hits for monomerid = 50571448
TargetSerine-protein kinase ATM(Homo sapiens (Human))
Charles River
Curated by ChEMBL
LigandPNGBDBM50571448(CHEMBL4872482)
Affinity DataKi:  110nM. Assay description: Inhibition of full length recombinant FLAG-tagged human ATM assessed as decrease in p53 S15 phosphorylation using full length myc-tagged p53 as subst...
Ligand InfoPC cidPC sid
In DepthDetails ArticlePubMed
TargetSerine-protein kinase ATM(Homo sapiens (Human))
Charles River
Curated by ChEMBL
LigandPNGBDBM50571448(CHEMBL4872482)
Affinity DataIC50: >3.00E+4nM. Assay description: Inhibition of ATM in human U2OS cells assessed as reduction in etoposide-stimulated KAP1 phosphorylation incubated for 60 mins by immunoreactivity as...
Ligand InfoPC cidPC sid
In DepthDetails ArticlePubMed