BDBM50571458 CHEMBL4846084::US11685734, Example 35
SMILES O=c1cc(cc([nH]1)N1CCCC[C@@H]1Cc1ccccc1)N1CCOCC1
InChI Key InChIKey=JJVQWARGSDQRCL-GOSISDBHSA-N
Data  2 KI  3 IC50
  Tab Delimited (TSV)   2D SDfile   Computed 3D by Vconf -m prep SDfile
Find this compound or compounds like it in BindingDB:
Activity Spreadsheet -- Enzyme Inhibition Constant Data from BindingDB
Found 5 hits for monomerid = 50571458
TargetSerine-protein kinase ATM(Homo sapiens (Human))
Charles River
Curated by ChEMBL
LigandPNGBDBM50571458(CHEMBL4846084 | US11685734, Example 35)
Affinity DataKi:  8nM. Assay description: Inhibition of full length recombinant FLAG-tagged human ATM assessed as decrease in p53 S15 phosphorylation using full length myc-tagged p53 as subst...
Ligand InfoPC cidPC sid
In DepthDetails ArticlePubMed
TargetPhosphatidylinositol 3-kinase catalytic subunit type 3(Homo sapiens (Human))
Charles River
Curated by ChEMBL
LigandPNGBDBM50571458(CHEMBL4846084 | US11685734, Example 35)
Affinity DataKi:  170nM. Assay description: Inhibition of full length recombinant GST-tagged human VPS34 expressed in baculovirus expression system using PI/PS as substrate incubated for 60 min...
Ligand InfoPC cidPC sid
In DepthDetails ArticlePubMed
TargetSerine/threonine-protein kinase ATR(Homo sapiens (Human))
Charles River
Curated by ChEMBL
LigandPNGBDBM50571458(CHEMBL4846084 | US11685734, Example 35)
Affinity DataIC50:  8.00E+3nM. Assay description: Inhibition of ATR in human HT-29 cells assessed as reduction in CHK1 phosphorylation incubated for 4 hrs
Ligand InfoPC cidPC sid
In DepthDetails ArticlePubMed
TargetSerine-protein kinase ATM(Homo sapiens (Human))
Charles River
Curated by ChEMBL
LigandPNGBDBM50571458(CHEMBL4846084 | US11685734, Example 35)
Affinity DataIC50:  53.2nM. Assay description: ATM: Recombinant, full length human FLAG-tagged ATM activity (Eurofins 14-933) was measured in an ELISA for p53 S15 phosphorylation, in a 384 well V-...
Ligand InfoPC cidPC sid
In DepthDetails US Patent
TargetSerine-protein kinase ATM(Homo sapiens (Human))
Charles River
Curated by ChEMBL
LigandPNGBDBM50571458(CHEMBL4846084 | US11685734, Example 35)
Affinity DataIC50:  2.50E+3nM. Assay description: Inhibition of ATM in human U2OS cells assessed as reduction in etoposide-stimulated KAP1 phosphorylation incubated for 60 mins by immunoreactivity as...
Ligand InfoPC cidPC sid
In DepthDetails ArticlePubMed