BDBM50571467 CHEMBL4850755
SMILES O=c1cc(nc([nH]1)N1CCCCC[C@@H]1Cc1ccccc1)N1CCOCC1
InChI Key InChIKey=VMAXCDSINZOJPZ-GOSISDBHSA-N
Data  2 KI  1 IC50
  Tab Delimited (TSV)   2D SDfile   Computed 3D by Vconf -m prep SDfile
Find this compound or compounds like it in BindingDB:
Activity Spreadsheet -- Enzyme Inhibition Constant Data from BindingDB
Found 3 hits for monomerid = 50571467
TargetSerine-protein kinase ATM(Homo sapiens (Human))
Charles River
Curated by ChEMBL
LigandPNGBDBM50571467(CHEMBL4850755)
Affinity DataKi:  0.100nM. Assay description: Inhibition of full length recombinant FLAG-tagged human ATM assessed as decrease in p53 S15 phosphorylation using full length myc-tagged p53 as subst...
Ligand InfoPC cidPC sid
In DepthDetails ArticlePubMed
TargetPhosphatidylinositol 3-kinase catalytic subunit type 3(Homo sapiens (Human))
Charles River
Curated by ChEMBL
LigandPNGBDBM50571467(CHEMBL4850755)
Affinity DataKi:  8nM. Assay description: Inhibition of full length recombinant GST-tagged human VPS34 expressed in baculovirus expression system using PI/PS as substrate incubated for 60 min...
Ligand InfoPC cidPC sid
In DepthDetails ArticlePubMed
TargetSerine-protein kinase ATM(Homo sapiens (Human))
Charles River
Curated by ChEMBL
LigandPNGBDBM50571467(CHEMBL4850755)
Affinity DataIC50:  200nM. Assay description: Inhibition of ATM in human U2OS cells assessed as reduction in etoposide-stimulated KAP1 phosphorylation incubated for 60 mins by immunoreactivity as...
Ligand InfoPC cidPC sid
In DepthDetails ArticlePubMed