BDBM50571474 CHEMBL4857803::US11685734, Example 211
SMILES [H][C@@]12C[C@]1([H])[C@H](Cc1ccccc1)N(C2)c1nc(cc(=O)[nH]1)N1CCOCC1
InChI Key InChIKey=KVVLNFCQHKOZRL-ULQDDVLXSA-N
Data  2 KI  2 IC50
  Tab Delimited (TSV)   2D SDfile   Computed 3D by Vconf -m prep SDfile
Find this compound or compounds like it in BindingDB:
Activity Spreadsheet -- Enzyme Inhibition Constant Data from BindingDB
Found 4 hits for monomerid = 50571474
TargetSerine-protein kinase ATM(Homo sapiens (Human))
Charles River
Curated by ChEMBL
LigandPNGBDBM50571474(CHEMBL4857803 | US11685734, Example 211)
Affinity DataKi:  0.600nM. Assay description: Inhibition of full length recombinant FLAG-tagged human ATM assessed as decrease in p53 S15 phosphorylation using full length myc-tagged p53 as subst...
Ligand InfoPC cidPC sid
In DepthDetails ArticlePubMed
TargetPhosphatidylinositol 3-kinase catalytic subunit type 3(Homo sapiens (Human))
Charles River
Curated by ChEMBL
LigandPNGBDBM50571474(CHEMBL4857803 | US11685734, Example 211)
Affinity DataKi:  5nM. Assay description: Inhibition of full length recombinant GST-tagged human VPS34 expressed in baculovirus expression system using PI/PS as substrate incubated for 60 min...
Ligand InfoPC cidPC sid
In DepthDetails ArticlePubMed
TargetSerine-protein kinase ATM(Homo sapiens (Human))
Charles River
Curated by ChEMBL
LigandPNGBDBM50571474(CHEMBL4857803 | US11685734, Example 211)
Affinity DataIC50:  450nM. Assay description: Inhibition of ATM in human U2OS cells assessed as reduction in etoposide-stimulated KAP1 phosphorylation incubated for 60 mins by immunoreactivity as...
Ligand InfoPC cidPC sid
In DepthDetails ArticlePubMed
TargetSerine-protein kinase ATM(Homo sapiens (Human))
Charles River
Curated by ChEMBL
LigandPNGBDBM50571474(CHEMBL4857803 | US11685734, Example 211)
Affinity DataIC50:  3.70nM. Assay description: ATM: Recombinant, full length human FLAG-tagged ATM activity (Eurofins 14-933) was measured in an ELISA for p53 S15 phosphorylation, in a 384 well V-...
Ligand InfoPC cidPC sid
In DepthDetails US Patent