BDBM50572932 CHEMBL4850573
SMILES NS(=O)(=O)c1ccc(Cc2c(CC3CC3)n(nc2-c2ccc(F)c(c2)-c2ccc(Oc3nn[nH]c3C(O)=O)cc2)-c2nc(cs2)C(O)=O)cc1F
InChI Key InChIKey=OLGHHCBVTKMRAO-UHFFFAOYSA-N
Data  4 IC50
  Tab Delimited (TSV)   2D SDfile   Computed 3D by Vconf -m prep SDfile
Find this compound or compounds like it in BindingDB:
Activity Spreadsheet -- Enzyme Inhibition Constant Data from BindingDB
Found 4 hits for monomerid = 50572932
Target2-Hydroxyacid oxidase 1(Homo sapiens (Human))
Chinook Therapeutics
Curated by ChEMBL
LigandPNGBDBM50572932(CHEMBL4850573)
Affinity DataIC50:  1.20nM. Assay description: Inhibition of recombinant human GOX expressed in Escherichia coli C41 (DE3) using glycolate as substrate preincubated for 10 mins followed by substra...
Ligand InfoPC cidPC sid
In DepthDetails ArticlePubMed
TargetL-lactate dehydrogenase A chain(Mus musculus (Mouse))
Chinook Therapeutics
Curated by ChEMBL
LigandPNGBDBM50572932(CHEMBL4850573)
Affinity DataIC50:  198nM. Assay description: Inhibition of LDHA in wild type CD1 mouse primary hepatocyte assessed as inhibition of lactate production using pyruvate as substrate measured after ...
Ligand InfoPC cidPC sid
In DepthDetails ArticlePubMed
TargetL-lactate dehydrogenase A chain(Mus musculus (Mouse))
Chinook Therapeutics
Curated by ChEMBL
LigandPNGBDBM50572932(CHEMBL4850573)
Affinity DataIC50:  0.400nM. Assay description: Inhibition of recombinant mouse LDHA expressed in BL21 gold (DE3) using sodium pyruvate as substrate preincubated for 10 mins followed by sodium pyru...
Ligand InfoPC cidPC sid
In DepthDetails ArticlePubMed
TargetL-lactate dehydrogenase A chain(Homo sapiens (Human))
Chinook Therapeutics
Curated by ChEMBL
LigandPNGBDBM50572932(CHEMBL4850573)
Affinity DataIC50:  0.0700nM. Assay description: Inhibition of recombinant human LDHA expressed in BL21 gold (DE3) using sodium pyruvate as substrate preincubated for 10 mins followed by sodium pyru...
Ligand InfoPC cidPC sid
In DepthDetails ArticlePubMed