BDBM50573180 CHEMBL4175737
SMILES COc1ncc(cc1S(=O)(=O)Nc1ccnc(c1)-c1ccc(CN2C[C@H](C)O[C@H](C)C2)cc1F)N1CCOCC1
InChI Key InChIKey=PYEOWMYSNXSXCF-BGYRXZFFSA-N
Data  1 KI  5 IC50
  Tab Delimited (TSV)   2D SDfile   Computed 3D by Vconf -m prep SDfile
Find this compound or compounds like it in BindingDB:
Activity Spreadsheet -- Enzyme Inhibition Constant Data from BindingDB
Found 6 hits for monomerid = 50573180
LigandPNGBDBM50573180(CHEMBL4175737)
Affinity DataKi:  0.0316nM. Assay description: Inhibition of recombinant human N-terminal His6-tagged full length P110delta/full length untagged human p85alpha expressed in baculovirus infected Sf...
Ligand InfoPC cidPC sid
In DepthDetails ArticlePubMed
TargetPhosphatidylinositol 4,5-bisphosphate 3-kinase catalytic subunit delta isoform(Homo sapiens (Human))
Glaxosmithkline R&D
Curated by ChEMBL
LigandPNGBDBM50573180(CHEMBL4175737)
Affinity DataIC50:  7.90nM. Assay description: Inhibition of PI3Kdelta in human whole blood assessed as reduction in cytostim-stimulated IFNgamma production preincubated for 1 hr followed by cytos...
Ligand InfoPC cidPC sid
In DepthDetails ArticlePubMed
LigandPNGBDBM50573180(CHEMBL4175737)
Affinity DataIC50:  1.59E+3nM. Assay description: Inhibition of recombinant human N-terminal His6-tagged full length P110beta/full length untagged human p85alpha expressed in baculovirus infected Sf2...
Ligand InfoPC cidPC sid
In DepthDetails ArticlePubMed
TargetPhosphatidylinositol 4,5-bisphosphate 3-kinase catalytic subunit gamma isoform(Homo sapiens (Human))
Glaxosmithkline R&D
Curated by ChEMBL
LigandPNGBDBM50573180(CHEMBL4175737)
Affinity DataIC50:  251nM. Assay description: Inhibition of recombinant human N-terminal His6-tagged full length P120gamma expressed in baculovirus infected Sf21 insect cells using PIP2 as substr...
Ligand InfoPC cidPC sid
In DepthDetails ArticlePubMed
LigandPNGBDBM50573180(CHEMBL4175737)
Affinity DataIC50:  1nM. Assay description: Inhibition of recombinant human N-terminal His6-tagged full length P110delta/full length untagged human p85alpha expressed in baculovirus infected Sf...
Ligand InfoPC cidPC sid
In DepthDetails ArticlePubMed
LigandPNGBDBM50573180(CHEMBL4175737)
Affinity DataIC50:  1.26E+3nM. Assay description: Inhibition of recombinant human N-terminal His6-tagged full length P110alpha/full length untagged human p85alpha expressed in baculovirus infected Sf...
Ligand InfoPC cidPC sid
In DepthDetails ArticlePubMed