BDBM50574149 CHEMBL4875348
SMILES [#7]S(=O)(=O)c1ccc([Se;v2][#6]-[#6](-[#8])-[#6][Se;v2]c2ccccc2)cc1
InChI Key InChIKey=BMFFFZXPNNWEAM-UHFFFAOYSA-N
Data  5 KI
  Tab Delimited (TSV)   2D SDfile   Computed 3D by Vconf -m prep SDfile
Find this compound or compounds like it in BindingDB:
Activity Spreadsheet -- Enzyme Inhibition Constant Data from BindingDB
Found 5 hits for monomerid = 50574149
TargetCarbonic anhydrase 2(Homo sapiens (Human))
University Of Florence
Curated by ChEMBL
LigandPNGBDBM50574149(CHEMBL4875348)
Affinity DataKi:  5nM. Assay description: Inhibition of recombinant human CA2 pre-incubated for 15 mins measured by phenol red dye based stopped flow CO2 hydration assay
Ligand InfoPC cidPC sid
In DepthDetails ArticlePubMed
TargetCarbonic anhydrase 4(Homo sapiens (Human))
University Of Florence
Curated by ChEMBL
LigandPNGBDBM50574149(CHEMBL4875348)
Affinity DataKi:  7.5nM. Assay description: Inhibition of recombinant human CA4 pre-incubated for 15 mins measured by phenol red dye based stopped flow CO2 hydration assay
Ligand InfoPC cidPC sid
In DepthDetails ArticlePubMed
TargetCarbonic anhydrase 7(Homo sapiens (Human))
University Of Florence
Curated by ChEMBL
LigandPNGBDBM50574149(CHEMBL4875348)
Affinity DataKi:  9.5nM. Assay description: Inhibition of recombinant human CA7 pre-incubated for 15 mins measured by phenol red dye based stopped flow CO2 hydration assay
Ligand InfoPC cidPC sid
In DepthDetails ArticlePubMed
TargetCarbonic anhydrase 9(Homo sapiens (Human))
University Of Florence
Curated by ChEMBL
LigandPNGBDBM50574149(CHEMBL4875348)
Affinity DataKi:  85nM. Assay description: Inhibition of recombinant human CA9 pre-incubated for 15 mins measured by phenol red dye based stopped flow CO2 hydration assay
Ligand InfoPC cidPC sid
In DepthDetails ArticlePubMed
TargetCarbonic anhydrase 1(Homo sapiens (Human))
University Of Florence
Curated by ChEMBL
LigandPNGBDBM50574149(CHEMBL4875348)
Affinity DataKi:  98nM. Assay description: Inhibition of recombinant human CA1 pre-incubated for 15 mins measured by phenol red dye based stopped flow CO2 hydration assay
Ligand InfoPC cidPC sid
In DepthDetails ArticlePubMed