BDBM50574647 CHEMBL4865940
SMILES COc1ccc(Sc2ccc(cc2)C(=O)C2CCN(CC2)C(=O)c2cccc(O)c2)cc1
InChI Key InChIKey=NAVFVFOZAITQOY-UHFFFAOYSA-N
Data  1 IC50
  Tab Delimited (TSV)   2D SDfile   Computed 3D by Vconf -m prep SDfile
Find this compound or compounds like it in BindingDB:
Activity Spreadsheet -- Enzyme Inhibition Constant Data from BindingDB
Found 1 hit for monomerid = 50574647
TargetMonoglyceride lipase(Homo sapiens (Human))
University Of Pisa
Curated by ChEMBL
LigandPNGBDBM50574647(CHEMBL4865940)
Affinity DataIC50:  32nM. Assay description: Inhibition of human recombinant MAGL using 4-NPA as substrate by microplate reader method
Ligand InfoPC cidPC sid
In DepthDetails ArticlePubMed