BDBM50574648 CHEMBL4871787
SMILES Oc1cccc(c1)C(=O)N1CCC(CC1)C(=O)c1ccc(Sc2cccc(c2)C(F)(F)F)cc1
InChI Key InChIKey=MYBLUKZXBUDTAV-UHFFFAOYSA-N
Data  1 IC50
  Tab Delimited (TSV)   2D SDfile   Computed 3D by Vconf -m prep SDfile
Find this compound or compounds like it in BindingDB:
Activity Spreadsheet -- Enzyme Inhibition Constant Data from BindingDB
Found 1 hit for monomerid = 50574648
TargetMonoglyceride lipase(Homo sapiens (Human))
University Of Pisa
Curated by ChEMBL
LigandPNGBDBM50574648(CHEMBL4871787)
Affinity DataIC50:  6.90nM. Assay description: Inhibition of human recombinant MAGL using 4-NPA as substrate by microplate reader method
Ligand InfoPC cidPC sid
In DepthDetails ArticlePubMed