BDBM50576688 CHEMBL4873020
SMILES COc1cc(CC(=O)NCc2ccc(CNC(=O)c3cccc(c3)-c3cccnc3)cc2)cc(OC)c1OC
InChI Key InChIKey=YQOBQKWDDRYWOS-UHFFFAOYSA-N
Data  2 KI  1 IC50  2 Kd
  Tab Delimited (TSV)   2D SDfile   Computed 3D by Vconf -m prep SDfile
Find this compound or compounds like it in BindingDB:
Activity Spreadsheet -- Enzyme Inhibition Constant Data from BindingDB
Found 5 hits for monomerid = 50576688
TargetNAD-dependent protein deacetylase sirtuin-2(Homo sapiens (Human))
The University Of Hong Kong
Curated by ChEMBL
LigandPNGBDBM50576688(CHEMBL4873020)
Affinity DataKi:  7.00E+3nM. Assay description: Inhibition of human recombinant SIRT2 assessed as inhibition of substrate deacetylation using Gln-Pro-Lys-Lys- (epsilon acetyl) AMC peptide as substr...
Ligand InfoPC cidPC sid
In DepthDetails ArticlePubMed
TargetNAD-dependent protein deacetylase sirtuin-3, mitochondrial(Homo sapiens (Human))
The University Of Hong Kong
Curated by ChEMBL
LigandPNGBDBM50576688(CHEMBL4873020)
Affinity DataKi:  2.82E+5nM. Assay description: Inhibition of human recombinant SIRT3 assessed as inhibition of substrate deacetylation using Gln-Pro-Lys-Lys- (epsilon acetyl) AMC peptide as substr...
Ligand InfoPC cidPC sid
In DepthDetails ArticlePubMed
TargetNAD-dependent protein deacetylase sirtuin-2(Homo sapiens (Human))
The University Of Hong Kong
Curated by ChEMBL
LigandPNGBDBM50576688(CHEMBL4873020)
Affinity DataIC50:  2.50E+4nM. Assay description: Inhibition of human recombinant SIRT2 assessed as inhibition of substrate deacetylation using Gln-Pro-Lys-Lys- (epsilon acetyl) AMC peptide as substr...
Ligand InfoPC cidPC sid
In DepthDetails ArticlePubMed
TargetNAD-dependent protein deacetylase sirtuin-3, mitochondrial(Homo sapiens (Human))
The University Of Hong Kong
Curated by ChEMBL
LigandPNGBDBM50576688(CHEMBL4873020)
Affinity DataKd:  3.92E+5nM. Assay description: Binding affinity to chip-immobilized recombinant human SIRT3 measured after 300 secs by surface plasmon resonance method
Ligand InfoPC cidPC sid
In DepthDetails ArticlePubMed
TargetNAD-dependent protein deacetylase sirtuin-2(Homo sapiens (Human))
The University Of Hong Kong
Curated by ChEMBL
LigandPNGBDBM50576688(CHEMBL4873020)
Affinity DataKd:  2.50E+4nM. Assay description: Binding affinity to chip-immobilized recombinant human SIRT2 measured after 300 secs by surface plasmon resonance method
Ligand InfoPC cidPC sid
In DepthDetails ArticlePubMed