BDBM50576692 CHEMBL4872768
SMILES COc1cc(CC(=O)NCCCNC(=O)c2cn3C(C)COc4c(N5CCN(C)CC5)c(F)cc(c34)c2=O)cc(OC)c1OC
InChI Key InChIKey=BDTYQFYTOAQODV-UHFFFAOYSA-N
Data  1 KI  1 IC50  1 Kd
  Tab Delimited (TSV)   2D SDfile   Computed 3D by Vconf -m prep SDfile
Find this compound or compounds like it in BindingDB:
Activity Spreadsheet -- Enzyme Inhibition Constant Data from BindingDB
Found 3 hits for monomerid = 50576692
TargetNAD-dependent protein deacetylase sirtuin-2(Homo sapiens (Human))
The University Of Hong Kong
Curated by ChEMBL
LigandPNGBDBM50576692(CHEMBL4872768)
Affinity DataKi:  1.10E+4nM. Assay description: Inhibition of human recombinant SIRT2 assessed as inhibition of substrate deacetylation using Gln-Pro-Lys-Lys- (epsilon acetyl) AMC peptide as substr...
Ligand InfoPC cidPC sid
In DepthDetails ArticlePubMed
TargetNAD-dependent protein deacetylase sirtuin-2(Homo sapiens (Human))
The University Of Hong Kong
Curated by ChEMBL
LigandPNGBDBM50576692(CHEMBL4872768)
Affinity DataKd:  3.90E+4nM. Assay description: Binding affinity to chip-immobilized recombinant human SIRT2 measured after 300 secs by surface plasmon resonance method
Ligand InfoPC cidPC sid
In DepthDetails ArticlePubMed
TargetNAD-dependent protein deacetylase sirtuin-2(Homo sapiens (Human))
The University Of Hong Kong
Curated by ChEMBL
LigandPNGBDBM50576692(CHEMBL4872768)
Affinity DataIC50:  3.90E+4nM. Assay description: Inhibition of human recombinant SIRT2 assessed as inhibition of substrate deacetylation using Gln-Pro-Lys-Lys- (epsilon acetyl) AMC peptide as substr...
Ligand InfoPC cidPC sid
In DepthDetails ArticlePubMed