BDBM50576701 CHEMBL4867959
SMILES O=C(NCCCCCCNC(=O)c1cccc(c1)-c1cccnc1)c1cccc(c1)-c1cccnc1
InChI Key InChIKey=MEOHOZDGWGFGNA-UHFFFAOYSA-N
Data  2 KI  1 IC50  2 Kd
  Tab Delimited (TSV)   2D SDfile   Computed 3D by Vconf -m prep SDfile
Find this compound or compounds like it in BindingDB:
Activity Spreadsheet -- Enzyme Inhibition Constant Data from BindingDB
Found 5 hits for monomerid = 50576701
TargetNAD-dependent protein deacetylase sirtuin-2(Homo sapiens (Human))
The University Of Hong Kong
Curated by ChEMBL
LigandPNGBDBM50576701(CHEMBL4867959)
Affinity DataKi:  1.20E+4nM. Assay description: Inhibition of human recombinant SIRT2 assessed as inhibition of substrate deacetylation using Gln-Pro-Lys-Lys- (epsilon acetyl) AMC peptide as substr...
Ligand InfoPC cidPC sid
In DepthDetails ArticlePubMed
TargetNAD-dependent protein deacetylase sirtuin-1(Homo sapiens (Human))
The University Of Hong Kong
Curated by ChEMBL
LigandPNGBDBM50576701(CHEMBL4867959)
Affinity DataKi:  7.30E+4nM. Assay description: Inhibition of human recombinant SIRT1 assessed as inhibition of substrate deacetylation using Gln-Pro-Lys-Lys- (epsilon acetyl) AMC peptide as substr...
Ligand InfoPC cidPC sid
In DepthDetails ArticlePubMed
TargetNAD-dependent protein deacetylase sirtuin-2(Homo sapiens (Human))
The University Of Hong Kong
Curated by ChEMBL
LigandPNGBDBM50576701(CHEMBL4867959)
Affinity DataKd:  4.00E+4nM. Assay description: Binding affinity to chip-immobilized recombinant human SIRT2 measured after 300 secs by surface plasmon resonance method
Ligand InfoPC cidPC sid
In DepthDetails ArticlePubMed
TargetNAD-dependent protein deacetylase sirtuin-1(Homo sapiens (Human))
The University Of Hong Kong
Curated by ChEMBL
LigandPNGBDBM50576701(CHEMBL4867959)
Affinity DataKd:  1.18E+5nM. Assay description: Binding affinity to chip-immobilized recombinant human SIRT1 measured after 300 secs by surface plasmon resonance method
Ligand InfoPC cidPC sid
In DepthDetails ArticlePubMed
TargetNAD-dependent protein deacetylase sirtuin-2(Homo sapiens (Human))
The University Of Hong Kong
Curated by ChEMBL
LigandPNGBDBM50576701(CHEMBL4867959)
Affinity DataIC50:  3.90E+4nM. Assay description: Inhibition of human recombinant SIRT2 assessed as inhibition of substrate deacetylation using Gln-Pro-Lys-Lys- (epsilon acetyl) AMC peptide as substr...
Ligand InfoPC cidPC sid
In DepthDetails ArticlePubMed