BDBM50576704 CHEMBL4871184
SMILES COc1cc(CC(=O)NCCOCCOCCOCCNC(=O)c2cccc(c2)-c2cccnc2)cc(OC)c1OC
InChI Key InChIKey=FKHNQCDEKDVEKJ-UHFFFAOYSA-N
Data  1 KI  1 IC50
  Tab Delimited (TSV)   2D SDfile   Computed 3D by Vconf -m prep SDfile
Find this compound or compounds like it in BindingDB:
Activity Spreadsheet -- Enzyme Inhibition Constant Data from BindingDB
Found 2 hits for monomerid = 50576704
TargetNAD-dependent protein deacetylase sirtuin-2(Homo sapiens (Human))
The University Of Hong Kong
Curated by ChEMBL
LigandPNGBDBM50576704(CHEMBL4871184)
Affinity DataKi:  2.70E+4nM. Assay description: Inhibition of human recombinant SIRT2 assessed as inhibition of substrate deacetylation using Gln-Pro-Lys-Lys- (epsilon acetyl) AMC peptide as substr...
Ligand InfoPC cidPC sid
In DepthDetails ArticlePubMed
TargetNAD-dependent protein deacetylase sirtuin-2(Homo sapiens (Human))
The University Of Hong Kong
Curated by ChEMBL
LigandPNGBDBM50576704(CHEMBL4871184)
Affinity DataIC50:  9.30E+4nM. Assay description: Inhibition of human recombinant SIRT2 assessed as inhibition of substrate deacetylation using Gln-Pro-Lys-Lys- (epsilon acetyl) AMC peptide as substr...
Ligand InfoPC cidPC sid
In DepthDetails ArticlePubMed