BDBM50576924 CHEMBL4861843
SMILES Nc1ncn(Cc2c(Cl)cccc2Cl)c2nc(nc12)-c1ccccc1Cl
InChI Key InChIKey=OPEYZJPHGVXJBX-UHFFFAOYSA-N
Data  1 IC50
  Tab Delimited (TSV)   2D SDfile   Computed 3D by Vconf -m prep SDfile
Find this compound or compounds like it in BindingDB:
Activity Spreadsheet -- Enzyme Inhibition Constant Data from BindingDB
Found 1 hit for monomerid = 50576924
TargetLow molecular weight phosphotyrosine protein phosphatase(Homo sapiens (Human))
University Of California
Curated by ChEMBL
LigandPNGBDBM50576924(CHEMBL4861843)
Affinity DataIC50:  171nM. Assay description: Inhibition of recombinant human LMPTP-A using OMFP or pNPP as substrate by fluorescence assay
Ligand InfoPC cidPC sid
In DepthDetails ArticlePubMed