BDBM50576925 CHEMBL4846731
SMILES Nc1ncn(Cc2c(Cl)cccc2Cl)c2nc(nc12)-c1cccc(Cl)c1
InChI Key InChIKey=YBRAGOCJZWACFJ-UHFFFAOYSA-N
Data  1 IC50
  Tab Delimited (TSV)   2D SDfile   Computed 3D by Vconf -m prep SDfile
Find this compound or compounds like it in BindingDB:
Activity Spreadsheet -- Enzyme Inhibition Constant Data from BindingDB
Found 1 hit for monomerid = 50576925
TargetLow molecular weight phosphotyrosine protein phosphatase(Homo sapiens (Human))
University Of California
Curated by ChEMBL
LigandPNGBDBM50576925(CHEMBL4846731)
Affinity DataIC50:  380nM. Assay description: Inhibition of recombinant human LMPTP-A using OMFP or pNPP as substrate by fluorescence assay
Ligand InfoPC cidPC sid
In DepthDetails ArticlePubMed