BDBM50576929 CHEMBL4859307
SMILES Cc1ccc(cc1)-c1nc2c(N)ncn(Cc3c(Cl)cccc3Cl)c2n1
InChI Key InChIKey=JWSZGUZSPRYQOD-UHFFFAOYSA-N
Data  1 IC50
  Tab Delimited (TSV)   2D SDfile   Computed 3D by Vconf -m prep SDfile
Find this compound or compounds like it in BindingDB:
Activity Spreadsheet -- Enzyme Inhibition Constant Data from BindingDB
Found 1 hit for monomerid = 50576929
TargetLow molecular weight phosphotyrosine protein phosphatase(Homo sapiens (Human))
University Of California
Curated by ChEMBL
LigandPNGBDBM50576929(CHEMBL4859307)
Affinity DataIC50:  119nM. Assay description: Inhibition of recombinant human LMPTP-A using OMFP or pNPP as substrate by fluorescence assay
Ligand InfoPC cidPC sid
In DepthDetails ArticlePubMed