BDBM50577341 CHEMBL4851482
SMILES COc1ccccc1C1=C(Nc2ccc(cc2)-c2ccccc2)C(=O)NC1=O
InChI Key InChIKey=HWWUVEVSUSYGLO-UHFFFAOYSA-N
Data  2 KI
  Tab Delimited (TSV)   2D SDfile   Computed 3D by Vconf -m prep SDfile
Find this compound or compounds like it in BindingDB:
Activity Spreadsheet -- Enzyme Inhibition Constant Data from BindingDB
Found 2 hits for monomerid = 50577341
TargetSTE20-like serine/threonine-protein kinase(Homo sapiens (Human))
University Of Campinas (Unicamp)
Curated by ChEMBL
LigandPNGBDBM50577341(CHEMBL4851482)
Affinity DataKi:  25nM. Assay description: Binding affinity human SLK by binding displacement assay
Ligand InfoPC cidPC sid
In DepthDetails ArticlePubMed
TargetSerine/threonine-protein kinase 10(Homo sapiens (Human))
University Of Campinas (Unicamp)
Curated by ChEMBL
LigandPNGBDBM50577341(CHEMBL4851482)
Affinity DataKi:  320nM. Assay description: Binding affinity human STK10 by binding displacement assay
Ligand InfoPC cidPC sid
In DepthDetails ArticlePubMed