BDBM50577369 CHEMBL4856751
SMILES COc1ccc(Br)cc1C1=C(Nc2cccc(c2)C#N)C(=O)NC1=O
InChI Key InChIKey=PJQXOWLFWLVNJN-UHFFFAOYSA-N
Data  2 KI  3 IC50
  Tab Delimited (TSV)   2D SDfile   Computed 3D by Vconf -m prep SDfile
Find this compound or compounds like it in BindingDB:
Activity Spreadsheet -- Enzyme Inhibition Constant Data from BindingDB
Found 5 hits for monomerid = 50577369
TargetSTE20-like serine/threonine-protein kinase(Homo sapiens (Human))
University Of Campinas (Unicamp)
Curated by ChEMBL
LigandPNGBDBM50577369(CHEMBL4856751)
Affinity DataKi:  9.70nM. Assay description: Binding affinity human SLK by binding displacement assay
Ligand InfoPC cidPC sid
In DepthDetails ArticlePubMed
TargetSerine/threonine-protein kinase 10(Homo sapiens (Human))
University Of Campinas (Unicamp)
Curated by ChEMBL
LigandPNGBDBM50577369(CHEMBL4856751)
Affinity DataKi:  61nM. Assay description: Binding affinity human STK10 by binding displacement assay
Ligand InfoPC cidPC sid
In DepthDetails ArticlePubMed
TargetSTE20-like serine/threonine-protein kinase(Homo sapiens (Human))
University Of Campinas (Unicamp)
Curated by ChEMBL
LigandPNGBDBM50577369(CHEMBL4856751)
Affinity DataIC50:  1.90E+4nM. Assay description: Inhibition of NanoLuc-fused SLK (unknown origin) expressed in HEK293T cells after 2 hrs by NanoBRET assay
Ligand InfoPC cidPC sid
In DepthDetails ArticlePubMed
TargetSerine/threonine-protein kinase 10(Homo sapiens (Human))
University Of Campinas (Unicamp)
Curated by ChEMBL
LigandPNGBDBM50577369(CHEMBL4856751)
Affinity DataIC50:  4.50E+3nM. Assay description: Inhibition of biotinylated full-length STK10 expressed in Escherichia coli DH10Bac assessed as transfer of radiolabelled phosphate from ATP by OMNIA ...
Ligand InfoPC cidPC sid
In DepthDetails ArticlePubMed
TargetSerine/threonine-protein kinase 10(Homo sapiens (Human))
University Of Campinas (Unicamp)
Curated by ChEMBL
LigandPNGBDBM50577369(CHEMBL4856751)
Affinity DataIC50:  99nM. Assay description: Inhibition of STK10 (unknown origin) expressed in Sf9 cells assessed as transfer of radiolabelled phosphate group from ATP by reaction biology method
Ligand InfoPC cidPC sid
In DepthDetails ArticlePubMed