BDBM50578603 CHEMBL4873082
SMILES Cl.CC(CCc1cccc(C)c1)NCC(O)c1ccc(O)c2[nH]c(=O)ccc12
InChI Key InChIKey=MLQSYBUOOQQRRI-UHFFFAOYSA-N
Data  2 EC50
  Tab Delimited (TSV)   2D SDfile   Computed 3D by Vconf -m prep SDfile
Find this compound or compounds like it in BindingDB:
Activity Spreadsheet -- Enzyme Inhibition Constant Data from BindingDB
Found 2 hits for monomerid = 50578603
TargetBeta-2 adrenergic receptor(Homo sapiens (Human))
Shenyang Pharmaceutical University
Curated by ChEMBL
LigandPNGBDBM50578603(CHEMBL4873082)
Affinity DataEC50:  0.0129nM. Assay description: Agonist activity at human beta2 adrenoreceptor overexpressed in HEK293 cells assessed as cAMP accumulation
Ligand InfoPC cidPC sid
In DepthDetails ArticlePubMed
TargetBeta-1 adrenergic receptor(Homo sapiens (Human))
Shenyang Pharmaceutical University
Curated by ChEMBL
LigandPNGBDBM50578603(CHEMBL4873082)
Affinity DataEC50:  4.10nM. Assay description: Agonist activity at human beta1 adrenoreceptor overexpressed in HEK293 cells assessed as cAMP accumulation
Ligand InfoPC cidPC sid
In DepthDetails ArticlePubMed