BDBM50578608 CHEMBL4848775
SMILES Cl.COc1ccc(CCC(C)(C)NCC(O)c2ccc(O)c3[nH]c(=O)ccc23)cc1
InChI Key InChIKey=LQAMAZKCVUBJNN-UHFFFAOYSA-N
Data  2 EC50
  Tab Delimited (TSV)   2D SDfile   Computed 3D by Vconf -m prep SDfile
Find this compound or compounds like it in BindingDB:
Activity Spreadsheet -- Enzyme Inhibition Constant Data from BindingDB
Found 2 hits for monomerid = 50578608
TargetBeta-2 adrenergic receptor(Homo sapiens (Human))
Shenyang Pharmaceutical University
Curated by ChEMBL
LigandPNGBDBM50578608(CHEMBL4848775)
Affinity DataEC50:  0.0309nM. Assay description: Agonist activity at human beta2 adrenoreceptor overexpressed in HEK293 cells assessed as cAMP accumulation
Ligand InfoPC cidPC sid
In DepthDetails ArticlePubMed
TargetBeta-1 adrenergic receptor(Homo sapiens (Human))
Shenyang Pharmaceutical University
Curated by ChEMBL
LigandPNGBDBM50578608(CHEMBL4848775)
Affinity DataEC50:  7.80nM. Assay description: Agonist activity at human beta1 adrenoreceptor overexpressed in HEK293 cells assessed as cAMP accumulation
Ligand InfoPC cidPC sid
In DepthDetails ArticlePubMed