BDBM50578824 CHEMBL4860533
SMILES COc1cc(Cl)c2nc(sc2c1)-c1cc(C)cc2c1ncn(C)c2=O
InChI Key InChIKey=KBPDHFGQIXJXCU-UHFFFAOYSA-N
Data  5 IC50
  Tab Delimited (TSV)   2D SDfile   Computed 3D by Vconf -m prep SDfile
Find this compound or compounds like it in BindingDB:
Activity Spreadsheet -- Enzyme Inhibition Constant Data from BindingDB
Found 5 hits for monomerid = 50578824
TargetProteinase-activated receptor 4(Mus musculus)
China Pharmaceutical University
Curated by ChEMBL
LigandPNGBDBM50578824(CHEMBL4860533)
Affinity DataIC50:  84nM. Assay description: Antagonist activity at PAR4 in ICR mouse platelet-rich plasma assessed as inhibition of PAR4 AP AYPGKF-NH2-induced platelet aggregation by photo-turb...
Ligand InfoPC cidPC sid
In DepthDetails ArticlePubMed
TargetProteinase-activated receptor 4(Homo sapiens (Human))
China Pharmaceutical University
Curated by ChEMBL
LigandPNGBDBM50578824(CHEMBL4860533)
Affinity DataIC50:  20nM. Assay description: Antagonist activity at PAR4 in human platelet-rich plasma assessed as inhibition of PAR4 AP AYPGKF-NH2-induced platelet aggregation by photo-turbidim...
Ligand InfoPC cidPC sid
In DepthDetails ArticlePubMed
TargetProteinase-activated receptor 2(Homo sapiens (Human))
China Pharmaceutical University
Curated by ChEMBL
LigandPNGBDBM50578824(CHEMBL4860533)
Affinity DataIC50: >1.00E+3nM. Assay description: Antagonist activity at human PAR2 expressed in Ga15-HEK293 cells assessed as reduction in PAR2 AP 2-furoyl-LIGRLO-NH2-induced cytosolic calcium incub...
Ligand InfoPC cidPC sid
In DepthDetails ArticlePubMed
TargetProteinase-activated receptor 1(Homo sapiens (Human))
China Pharmaceutical University
Curated by ChEMBL
LigandPNGBDBM50578824(CHEMBL4860533)
Affinity DataIC50: >3.16E+3nM. Assay description: Antagonist activity at human PAR1 expressed in Ga15-HEK293 cells assessed as reduction in PAR1 AP SFFLRR-NH2-induced cytosolic calcium incubated for ...
Ligand InfoPC cidPC sid
In DepthDetails ArticlePubMed
TargetProteinase-activated receptor 4(Homo sapiens (Human))
China Pharmaceutical University
Curated by ChEMBL
LigandPNGBDBM50578824(CHEMBL4860533)
Affinity DataIC50:  0.530nM. Assay description: Antagonist activity at human PAR4 expressed in Ga15-HEK293 cells assessed as reduction in PAR4 AP AYPGKF-NH2-induced cytosolic calcium incubated for ...
Ligand InfoPC cidPC sid
In DepthDetails ArticlePubMed