BDBM50579499 CHEMBL4847875
SMILES CN(C)c1ccc2c(Oc3ccc(NC(=O)NCc4ccc(nc4)C(F)(F)F)cc3)ncnc2c1
InChI Key InChIKey=ORYMWWSJZRCUSV-UHFFFAOYSA-N
Data  12 IC50
  Tab Delimited (TSV)   2D SDfile   Computed 3D by Vconf -m prep SDfile
Find this compound or compounds like it in BindingDB:
Activity Spreadsheet -- Enzyme Inhibition Constant Data from BindingDB
Found 12 hits for monomerid = 50579499
TargetMacrophage colony-stimulating factor 1 receptor(Homo sapiens (Human))
National Health Research Institutes
Curated by ChEMBL
LigandPNGBDBM50579499(CHEMBL4847875)
Affinity DataIC50:  14nM. Assay description: Inhibition of human recombinant GST-CSF1R (residues L534 to C972) expressed in Sf9 insect cells using poly(Glu,Tyr) as substrate incubated for 20 min...
In DepthDetails ArticlePubMed
TargetAurora kinase A(Homo sapiens (Human))
National Health Research Institutes
Curated by ChEMBL
LigandPNGBDBM50579499(CHEMBL4847875)
Affinity DataIC50: >1.00E+4nM. Assay description: Inhibition of recombinant GST-AURKA (residues Ser123 to Ser401) (unknown origin) expressed in Sf9 insect cells using tetra(-LRRASLG) peptide as subst...
In DepthDetails ArticlePubMed
TargetAurora kinase B(Homo sapiens (Human))
National Health Research Institutes
Curated by ChEMBL
LigandPNGBDBM50579499(CHEMBL4847875)
Affinity DataIC50:  1.40E+3nM. Assay description: Inhibition of human recombinant full length GST-AURKB using tetra(-LRRASLG) peptide as substrate incubated for 20 mins by ATP Kinase Glo assay
In DepthDetails ArticlePubMed
TargetMacrophage colony-stimulating factor 1 receptor(Homo sapiens (Human))
National Health Research Institutes
Curated by ChEMBL
LigandPNGBDBM50579499(CHEMBL4847875)
Affinity DataIC50:  0.530nM. Assay description: Inhibition of wild-type human partial length CSF1R (I564 to S939 residues) expressed in bacterial expression system by Kinomescan method
In DepthDetails ArticlePubMed
TargetMast/stem cell growth factor receptor Kit(Homo sapiens (Human))
National Health Research Institutes
Curated by ChEMBL
LigandPNGBDBM50579499(CHEMBL4847875)
Affinity DataIC50:  1.10nM. Assay description: Inhibition of human c-Kit by Kinomescan method
In DepthDetails ArticlePubMed
TargetVascular endothelial growth factor receptor 2(Homo sapiens (Human))
National Health Research Institutes
Curated by ChEMBL
LigandPNGBDBM50579499(CHEMBL4847875)
Affinity DataIC50: >9.00E+3nM. Assay description: Inhibition of wild-type human partial length VEGFR2 (R787 to P1253 residues) expressed in mammalian expression system by Kinomescan method
In DepthDetails ArticlePubMed
TargetPlatelet-derived growth factor receptor beta(Homo sapiens (Human))
National Health Research Institutes
Curated by ChEMBL
LigandPNGBDBM50579499(CHEMBL4847875)
Affinity DataIC50:  32nM. Assay description: Inhibition of wild-type human partial length PDGFRbeta (V582 to Y1009 residues) expressed in bacterial expression system by Kinomescan method
In DepthDetails ArticlePubMed
TargetEpithelial discoidin domain-containing receptor 1(Homo sapiens (Human))
National Health Research Institutes
Curated by ChEMBL
LigandPNGBDBM50579499(CHEMBL4847875)
Affinity DataIC50:  60nM. Assay description: Inhibition of wild-type human partial length DDR1 (R565 to V876 residues) expressed in bacterial expression system by Kinomescan method
In DepthDetails ArticlePubMed
TargetReceptor-type tyrosine-protein kinase FLT3(Homo sapiens (Human))
National Health Research Institutes
Curated by ChEMBL
LigandPNGBDBM50579499(CHEMBL4847875)
Affinity DataIC50:  64nM. Assay description: Inhibition of wild-type human partial length FLT3 (V592 to Y969 residues) expressed in bacterial expression system by Kinomescan method
In DepthDetails ArticlePubMed
TargetAurora kinase B(Homo sapiens (Human))
National Health Research Institutes
Curated by ChEMBL
LigandPNGBDBM50579499(CHEMBL4847875)
Affinity DataIC50:  226nM. Assay description: Inhibition of wild-type human partial length AURKB (D25 to A303 residues) expressed in mammalian expression system by Kinomescan method
In DepthDetails ArticlePubMed
TargetSerine/threonine-protein kinase PAK 3(Homo sapiens (Human))
National Health Research Institutes
Curated by ChEMBL
LigandPNGBDBM50579499(CHEMBL4847875)
Affinity DataIC50: >9.00E+3nM. Assay description: Inhibition of wild-type human full length PAK3 (M1 to R544 residues) expressed in bacterial expression system by Kinomescan method
In DepthDetails ArticlePubMed
TargetPlatelet-derived growth factor receptor alpha(Homo sapiens (Human))
National Health Research Institutes
Curated by ChEMBL
LigandPNGBDBM50579499(CHEMBL4847875)
Affinity DataIC50:  53nM. Assay description: Inhibition of wild-type human partial length PDGFRalpha (V575 to D1002 residues) expressed in mammalian expression system by Kinomescan method
In DepthDetails ArticlePubMed