BDBM50579736 CHEMBL5078645
SMILES CS(=O)(=O)c1cccc(NC(=O)[C@H]2CC[C@H](CC2)n2cnc3c(N)ncnc23)c1
InChI Key InChIKey=ZBSYEZYIXGWFPE-XBXGTLAGSA-N
Data  1 IC50
  Tab Delimited (TSV)   2D SDfile   Computed 3D by Vconf -m prep SDfile
Find this compound or compounds like it in BindingDB:
Activity Spreadsheet -- Enzyme Inhibition Constant Data from BindingDB
Found 1 hit for monomerid = 50579736
TargetCholine kinase alpha(Homo sapiens (Human))
Nerviano Medical Sciences
Curated by ChEMBL
LigandPNGBDBM50579736(CHEMBL5078645)
Affinity DataIC50:  289nM. Assay description: Inhibition of ChoKalpha (unknown origin) by HTS assay
Ligand InfoPC cidPC sid
In DepthDetails ArticlePubMed