BDBM50579739 CHEMBL5088934
SMILES COc1ccc(NC(=O)[C@H]2CC[C@H](CC2)n2cnc3c(N)ncnc23)cc1
InChI Key InChIKey=UBDFPPBULIYROT-XBXGTLAGSA-N
Data  1 IC50
  Tab Delimited (TSV)   2D SDfile   Computed 3D by Vconf -m prep SDfile
Find this compound or compounds like it in BindingDB:
Activity Spreadsheet -- Enzyme Inhibition Constant Data from BindingDB
Found 1 hit for monomerid = 50579739
TargetCholine kinase alpha(Homo sapiens (Human))
Nerviano Medical Sciences
Curated by ChEMBL
LigandPNGBDBM50579739(CHEMBL5088934)
Affinity DataIC50:  377nM. Assay description: Inhibition of ChoKalpha (unknown origin) by HTS assay
Ligand InfoPC cidPC sid
In DepthDetails ArticlePubMed