BDBM50579745 CHEMBL5076233
SMILES COc1cccc(NC(=O)[C@H]2CC[C@H](CC2)n2cnc3c(N)nc(nc23)-c2ccc(O)cc2)c1
InChI Key InChIKey=PVRSVOPIMLSVTK-MAEOIBBWSA-N
Data  1 IC50
  Tab Delimited (TSV)   2D SDfile   Computed 3D by Vconf -m prep SDfile
Find this compound or compounds like it in BindingDB:
Activity Spreadsheet -- Enzyme Inhibition Constant Data from BindingDB
Found 1 hit for monomerid = 50579745
TargetCholine kinase alpha(Homo sapiens (Human))
Nerviano Medical Sciences
Curated by ChEMBL
LigandPNGBDBM50579745(CHEMBL5076233)
Affinity DataIC50:  871nM. Assay description: Inhibition of ChoKalpha (unknown origin) by HTS assay
Ligand InfoPC cidPC sid
In DepthDetails ArticlePubMed