BDBM50579747 CHEMBL5073844
SMILES COc1cccc(NC(=O)[C@H]2CC[C@H](CC2)n2cnc3c(N)nc(nc23)-c2ccncc2)c1
InChI Key InChIKey=JLJXNSYNQKBEKE-MAEOIBBWSA-N
Data  1 IC50
PDB links: 1 PDB ID matches this monomer.
  Tab Delimited (TSV)   2D SDfile   Computed 3D by Vconf -m prep SDfile
Find this compound or compounds like it in BindingDB:
Activity Spreadsheet -- Enzyme Inhibition Constant Data from BindingDB
Found 1 hit for monomerid = 50579747
TargetCholine kinase alpha(Homo sapiens (Human))
Nerviano Medical Sciences
Curated by ChEMBL
LigandPNGBDBM50579747(CHEMBL5073844)
Affinity DataIC50:  410nM. Assay description: Inhibition of ChoKalpha (unknown origin) by HTS assay
Ligand InfoPC cidPC sidPDB
In DepthDetails ArticlePubMed