BDBM50579749 CHEMBL5089622
SMILES COc1cccc(NC(=O)[C@H]2CC[C@H](CC2)n2cnc3c(N)nc(nc23)-c2cccc(c2)C(N)=O)c1
InChI Key InChIKey=HSCVAFOCWCEHKC-GLRZTSSQSA-N
Data  1 IC50
  Tab Delimited (TSV)   2D SDfile   Computed 3D by Vconf -m prep SDfile
Find this compound or compounds like it in BindingDB:
Activity Spreadsheet -- Enzyme Inhibition Constant Data from BindingDB
Found 1 hit for monomerid = 50579749
TargetCholine kinase alpha(Homo sapiens (Human))
Nerviano Medical Sciences
Curated by ChEMBL
LigandPNGBDBM50579749(CHEMBL5089622)
Affinity DataIC50:  774nM. Assay description: Inhibition of ChoKalpha (unknown origin) by HTS assay
Ligand InfoPC cidPC sid
In DepthDetails ArticlePubMed