BDBM50579769 CHEMBL5075042
SMILES COc1ccc2nc(NC(=O)[C@H]3CC[C@H](CC3)n3cnc4c(N)nc(Cl)nc34)sc2c1
InChI Key InChIKey=BVCQXWUWAMEFBC-PHIMTYICSA-N
Data  2 IC50
  Tab Delimited (TSV)   2D SDfile   Computed 3D by Vconf -m prep SDfile
Find this compound or compounds like it in BindingDB:
Activity Spreadsheet -- Enzyme Inhibition Constant Data from BindingDB
Found 2 hits for monomerid = 50579769
TargetCholine/ethanolamine kinase(Homo sapiens (Human))
Nerviano Medical Sciences
Curated by ChEMBL
LigandPNGBDBM50579769(CHEMBL5075042)
Affinity DataIC50:  5.03E+3nM. Assay description: Inhibition of ChoKbeta (unknown origin) by HTS assay
Ligand InfoPC cidPC sid
In DepthDetails ArticlePubMed
TargetCholine kinase alpha(Homo sapiens (Human))
Nerviano Medical Sciences
Curated by ChEMBL
LigandPNGBDBM50579769(CHEMBL5075042)
Affinity DataIC50:  23nM. Assay description: Inhibition of ChoKalpha (unknown origin) by HTS assay
Ligand InfoPC cidPC sid
In DepthDetails ArticlePubMed