BDBM50582449 CHEMBL5093828
SMILES CC(C)Nc1nc2CN(C=Cc2nc1N1CCC(CC1)Oc1ccc(F)cc1F)C(C)=O
InChI Key InChIKey=FWUPOBWZOCAFFY-UHFFFAOYSA-N
Data  1 KI  2 IC50  1 EC50
  Tab Delimited (TSV)   2D SDfile   Computed 3D by Vconf -m prep SDfile
Find this compound or compounds like it in BindingDB:
Activity Spreadsheet -- Enzyme Inhibition Constant Data from BindingDB
Found 4 hits for monomerid = 50582449
TargetG-protein coupled receptor 6(Homo sapiens (Human))
Takeda California
Curated by ChEMBL
LigandPNGBDBM50582449(CHEMBL5093828)
Affinity DataKi:  16nM. Assay description: Displacement of 3H-RL338 from human GPR6 expressed in T-REx-CHO-GPR6 cells assessed as inhibition constant by competition binding assay
Ligand InfoPC cidPC sid
In DepthDetails ArticlePubMed
TargetPotassium voltage-gated channel subfamily H member 2(Homo sapiens (Human))
Takeda California
Curated by ChEMBL
LigandPNGBDBM50582449(CHEMBL5093828)
Affinity DataIC50:  6.20E+3nM. Assay description: Inhibition of human ERG
Ligand InfoPC cidPC sid
In DepthDetails ArticlePubMed
TargetG-protein coupled receptor 6(Homo sapiens (Human))
Takeda California
Curated by ChEMBL
LigandPNGBDBM50582449(CHEMBL5093828)
Affinity DataEC50:  3.40E+4nM. Assay description: Inverse agonist activity at human GPR6 expressed in CHO-K1 cells assessed as modulation of cAMP level incubated for 20 hrs by TR-FRET assay
Ligand InfoPC cidPC sid
In DepthDetails ArticlePubMed
TargetCytochrome P450 2D6(Homo sapiens (Human))
Takeda California
Curated by ChEMBL
LigandPNGBDBM50582449(CHEMBL5093828)
Affinity DataIC50:  3.98E+3nM. Assay description: Inhibition of CYP2D6 (unknown origin)
Ligand InfoPC cidPC sid
In DepthDetails ArticlePubMed