BDBM50583200 CHEMBL5093708
SMILES Cc1cc(C)n(n1)-c1nc(C)cc(N[C@@H]2CC[C@H](F)CC2)n1
InChI Key InChIKey=MGRQRDPJVVKWSJ-OKILXGFUSA-N
Data  1 EC50
  Tab Delimited (TSV)   2D SDfile   Computed 3D by Vconf -m prep SDfile
Find this compound or compounds like it in BindingDB:
Activity Spreadsheet -- Enzyme Inhibition Constant Data from BindingDB
Found 1 hit for monomerid = 50583200
TargetSmall conductance calcium-activated potassium channel protein 2(Rattus norvegicus (Rat))
Chapman University School Of Pharmacy
Curated by ChEMBL
LigandPNGBDBM50583200(CHEMBL5093708)
Affinity DataEC50: >1.00E+5nM. Assay description: Potentiation of rat KCa2.2a expressed in HEK293 cells at -90 mV holding potential measured at 1 to 2 days by patch clamp electrophysiology
Ligand InfoPC cidPC sid
In DepthDetails ArticlePubMed