BDBM50587085 CHEMBL5092179
SMILES C[C@@H]1NC(=O)[C@@H]2CCCN2C(=O)[C@H](Cc2cnc[nH]2)NC(=O)[C@H](CO)NC(=O)[C@@H]2CSSC[C@H](NC(=O)[C@H](Cc3ccc(OS(O)(=O)=O)cc3)NC(=O)[C@H](CC(O)=O)NC(=O)[C@H](CCC(N)=O)NC(=O)[C@H](CC(N)=O)NC(=O)[C@H](CC(N)=O)NC(=O)[C@H](C)NC(=O)[C@H](C)NC(=O)[C@H](CSSC[C@H](NC(=O)CNC(=O)CN)C(=O)N2)NC1=O)C(N)=O
InChI Key InChIKey=ZLHFLGRXDMPWCU-AOALLVCUSA-N
Data  1 KI  2 IC50
  Tab Delimited (TSV)   2D SDfile   Computed 3D by Vconf -m prep SDfile
Find this compound or compounds like it in BindingDB:
Activity Spreadsheet -- Enzyme Inhibition Constant Data from BindingDB
Found 3 hits for monomerid = 50587085
TargetAcetylcholine-binding protein(Lymnaea stagnalis)
The University Of Queensland
Curated by ChEMBL
LigandPNGBDBM50587085(CHEMBL5092179)
Affinity DataKi:  5.37E+3nM. Assay description: Displacement of [3H]-epibatidine from Lymnaea stagnalis Acetylcholine-binding protein measured after 1 hr by liquid scintillation counter
Ligand InfoPC cidPC sid
In DepthDetails PubMed
TargetNeuronal acetylcholine receptor subunit alpha-7(Rattus norvegicus (Rat))
Hainan University
Curated by ChEMBL
LigandPNGBDBM50587085(CHEMBL5092179)
Affinity DataIC50:  76nM. Assay description: Antagonist activity at rat alpha7 nAChR expressed in xenopus oocytes assessed as inhibition of Ach- induced response at -70 mV holding potential prei...
Ligand InfoPC cidPC sid
In DepthDetails ArticlePubMed
TargetNeuronal acetylcholine receptor subunit alpha-3/beta-2(Rattus norvegicus (Rat))
Hainan University
Curated by ChEMBL
LigandPNGBDBM50587085(CHEMBL5092179)
Affinity DataIC50:  0.280nM. Assay description: Antagonist activity at rat alpha3beta2 nAChR expressed in xenopus oocytes assessed as inhibition of Ach- induced response at -70 mV holding potential...
Ligand InfoPC cidPC sid
In DepthDetails ArticlePubMed