BDBM50588624 CHEMBL5189628
SMILES OC1c2ccc(Cl)cc2CCC\C1=C/C(O)=O
InChI Key InChIKey=KMCKVWGKONABQA-VQHVLOKHSA-N
Data  2 KI
  Tab Delimited (TSV)   2D SDfile   Computed 3D by Vconf -m prep SDfile
Find this compound or compounds like it in BindingDB:
Activity Spreadsheet -- Enzyme Inhibition Constant Data from BindingDB
Found 2 hits for monomerid = 50588624
TargetCalcium/calmodulin-dependent protein kinase type II subunit alpha(Rattus norvegicus (rat))
University Of Copenhagen
Curated by ChEMBL
LigandPNGBDBM50588624(CHEMBL5189628)
Affinity DataKi:  50nM. Assay description: Displacement of [3H]NCS-382 from CaMK2alpha in rat brain cortical membrane homogenates measured after 1 hr by TopCount scintillation counting method
Ligand InfoPC cidPC sid
In DepthDetails PubMed
TargetCalcium/calmodulin-dependent protein kinase type II subunit alpha(Rattus norvegicus (rat))
University Of Copenhagen
Curated by ChEMBL
LigandPNGBDBM50588624(CHEMBL5189628)
Affinity DataKi:  52nM. Assay description: Displacement of [3H]NCS-382 from CaMK2alpha in rat brain cortical membrane homogenates measured after 1 hr by TopCount scintillation counting method
Ligand InfoPC cidPC sid
In DepthDetails PubMed