BDBM50588632 CHEMBL5176248
SMILES OC1c2ccc(\C=C\c3ccccc3)cc2CCC\C1=C/C(O)=O
InChI Key InChIKey=QMIRVJNLLMKNFX-BFHPBESDSA-N
Data  4 KI
  Tab Delimited (TSV)   2D SDfile   Computed 3D by Vconf -m prep SDfile
Find this compound or compounds like it in BindingDB:
Activity Spreadsheet -- Enzyme Inhibition Constant Data from BindingDB
Found 4 hits for monomerid = 50588632
TargetCalcium/calmodulin-dependent protein kinase type II subunit alpha(Rattus norvegicus (rat))
University Of Copenhagen
Curated by ChEMBL
LigandPNGBDBM50588632(CHEMBL5176248)
Affinity DataKi:  40nM. Assay description: Displacement of [3H]NCS-382 from CaMK2alpha in rat brain cortical membrane homogenates measured after 1 hr by TopCount scintillation counting method
Ligand InfoPC cidPC sid
In DepthDetails PubMed
TargetCalcium/calmodulin-dependent protein kinase type II subunit alpha(Rattus norvegicus (rat))
University Of Copenhagen
Curated by ChEMBL
LigandPNGBDBM50588632(CHEMBL5176248)
Affinity DataKi:  40nM. Assay description: Displacement of [3H]NCS-382 from CaMK2alpha in rat brain cortical membrane homogenates measured after 1 hr by TopCount scintillation counting method
Ligand InfoPC cidPC sid
In DepthDetails PubMed
TargetCalcium/calmodulin-dependent protein kinase type II subunit alpha(Rattus norvegicus (rat))
University Of Copenhagen
Curated by ChEMBL
LigandPNGBDBM50588632(CHEMBL5176248)
Affinity DataKi:  50nM. Assay description: Displacement of [3H]HOCPCA from native CaMK2alpha in rat brain cortical membrane homogenates measured after 1 hr by TopCount scintillation counting m...
Ligand InfoPC cidPC sid
In DepthDetails PubMed
TargetCalcium/calmodulin-dependent protein kinase type II subunit alpha(Rattus norvegicus (rat))
University Of Copenhagen
Curated by ChEMBL
LigandPNGBDBM50588632(CHEMBL5176248)
Affinity DataKi:  50nM. Assay description: Displacement of [3H]HOCPCA from native CaMK2alpha in rat brain cortical membrane homogenates measured after 1 hr by TopCount scintillation counting m...
Ligand InfoPC cidPC sid
In DepthDetails PubMed