BDBM50594783 CHEMBL5180765
SMILES Fc1ccc(NC2=N\C(=C/c3ccc4OCOc4c3)C(=O)N2)cc1
InChI Key InChIKey=ZQZULRTVXPNQNP-QPEQYQDCSA-N
Data  11 IC50
  Tab Delimited (TSV)   2D SDfile   Computed 3D by Vconf -m prep SDfile
Find this compound or compounds like it in BindingDB:
Activity Spreadsheet -- Enzyme Inhibition Constant Data from BindingDB
Found 11 hits for monomerid = 50594783
TargetGlycogen synthase kinase-3 beta/[Tau protein] kinase(Sus scrofa)
Manros Therapeutics & Perha Pharmaceuticals
Curated by ChEMBL
LigandPNGBDBM50594783(CHEMBL5180765)
Affinity DataIC50:  8.80E+3nM. Assay description: Inhibition of porcine brain GSK-3alpha/beta using YRRAAVPPSPSLSRHSSPHQpSEDEEE as substrate incubated for 30 mins in presence of ATP by scintillation ...
Ligand InfoPC cidPC sid
In DepthDetails PubMed
TargetDual specificity protein kinase CLK4(Mus musculus)
Manros Therapeutics & Perha Pharmaceuticals
Curated by ChEMBL
LigandPNGBDBM50594783(CHEMBL5180765)
Affinity DataIC50:  50nM. Assay description: Inhibition of GST-fused mouse recombinant CLK4 expressed in Escherichia coli using GRSRSRSRSRSR peptide as substrate incubated for 30 mins in presenc...
Ligand InfoPC cidPC sid
In DepthDetails PubMed
TargetDual specificity protein kinase CLK3(Mus musculus)
Manros Therapeutics & Perha Pharmaceuticals
Curated by ChEMBL
LigandPNGBDBM50594783(CHEMBL5180765)
Affinity DataIC50: >1.00E+4nM. Assay description: Inhibition of GST-fused mouse recombinant CLK3 expressed in Escherichia coli using GRSRSRSRSRSR peptide as substrate incubated for 30 mins in presenc...
Ligand InfoPC cidPC sid
In DepthDetails PubMed
TargetDual specificity protein kinase CLK1(Mus musculus)
Manros Therapeutics & Perha Pharmaceuticals
Curated by ChEMBL
LigandPNGBDBM50594783(CHEMBL5180765)
Affinity DataIC50:  62nM. Assay description: Inhibition of GST-fused mouse recombinant CLK1 expressed in Escherichia coli using GRSRSRSRSRSR peptide as substrate incubated for 30 mins in presenc...
Ligand InfoPC cidPC sid
In DepthDetails PubMed
TargetDual specificity protein kinase CLK2(Mus musculus)
Manros Therapeutics & Perha Pharmaceuticals
Curated by ChEMBL
LigandPNGBDBM50594783(CHEMBL5180765)
Affinity DataIC50:  260nM. Assay description: Inhibition of mouse recombinant GST-fused CLK2 expressed in Escherichia coli using GRSRSRSRSRSR peptide as substrate incubated for 30 mins in presenc...
Ligand InfoPC cidPC sid
In DepthDetails PubMed
TargetCasein kinase II subunit alpha 3(Homo sapiens)
Manros Therapeutics & Perha Pharmaceuticals
Curated by ChEMBL
LigandPNGBDBM50594783(CHEMBL5180765)
Affinity DataIC50:  8.80E+3nM. Assay description: Inhibition of human recombinant CK2 using RRRDDDSDDD peptide as substrate incubated for 30 mins in presence of ATP by scintillation counting method
Ligand InfoPC cidPC sid
In DepthDetails PubMed
TargetDual specificity tyrosine-phosphorylation-regulated kinase 1B(Homo sapiens (Human))
Manros Therapeutics & Perha Pharmaceuticals
Curated by ChEMBL
LigandPNGBDBM50594783(CHEMBL5180765)
Affinity DataIC50:  100nM. Assay description: Inhibition of GST-fused human recombinant DYRK1B expressed in Escherichia coli using GRSRSRSRSRSR peptide as substrate incubated for 30 mins in prese...
Ligand InfoPC cidPC sid
In DepthDetails PubMed
TargetDual specificity tyrosine-phosphorylation-regulated kinase 2(Homo sapiens (Human))
Manros Therapeutics & Perha Pharmaceuticals
Curated by ChEMBL
LigandPNGBDBM50594783(CHEMBL5180765)
Affinity DataIC50:  35nM. Assay description: Inhibition of GST-fused human recombinant DYRK2 expressed in Escherichia coli using GRSRSRSRSRSR peptide as substrate incubated for 30 mins in presen...
Ligand InfoPC cidPC sid
In DepthDetails PubMed
TargetDual specificity tyrosine-phosphorylation-regulated kinase 3(Homo sapiens (Human))
Manros Therapeutics & Perha Pharmaceuticals
Curated by ChEMBL
LigandPNGBDBM50594783(CHEMBL5180765)
Affinity DataIC50:  930nM. Assay description: Inhibition of GST-fused human recombinant DYRK3 expressed in Escherichia coli using GRSRSRSRSRSR peptide as substrate incubated for 30 mins in presen...
Ligand InfoPC cidPC sid
In DepthDetails PubMed
TargetSerine/threonine-protein kinase pim-1(Homo sapiens (Human))
Manros Therapeutics & Perha Pharmaceuticals
Curated by ChEMBL
LigandPNGBDBM50594783(CHEMBL5180765)
Affinity DataIC50:  9.30E+3nM. Assay description: Inhibition of human recombinant Pim1 expressed in Escherichia coli using histone H1 as substrate incubated for 30 mins in presence of ATP by scintill...
Ligand InfoPC cidPC sid
In DepthDetails PubMed
TargetDual specificity tyrosine-phosphorylation-regulated kinase 1A(Homo sapiens (Human))
Manros Therapeutics & Perha Pharmaceuticals
Curated by ChEMBL
LigandPNGBDBM50594783(CHEMBL5180765)
Affinity DataIC50:  28nM. Assay description: Inhibition of GST-fused human recombinant DYRK1A expressed in Escherichia coli using GRSRSRSRSRSR peptide as substrate incubated for 30 mins in prese...
Ligand InfoPC cidPC sid
In DepthDetails PubMed