BDBM50596223 CHEMBL5200241
SMILES CN1CCC(CC1)n1cc(cn1)-c1cnc(N)c2C(=O)N(CCc12)C1CCCCC1
InChI Key InChIKey=AJRCHNXNYNADRQ-UHFFFAOYSA-N
Data  4 IC50
  Tab Delimited (TSV)   2D SDfile   Computed 3D by Vconf -m prep SDfile
Find this compound or compounds like it in BindingDB:
Activity Spreadsheet -- Enzyme Inhibition Constant Data from BindingDB
Found 4 hits for monomerid = 50596223
TargetSerine/threonine-protein kinase receptor R3(Homo sapiens (Human))
Incyte
Curated by ChEMBL
LigandPNGBDBM50596223(CHEMBL5200241)
Affinity DataIC50:  17nM. Assay description: Inhibition of ALK1 (unknown origin)
Ligand InfoPC cidPC sid
In DepthDetails PubMed
TargetActivin receptor type-1(Homo sapiens (Human))
Incyte
Curated by ChEMBL
LigandPNGBDBM50596223(CHEMBL5200241)
Affinity DataIC50:  133nM. Assay description: Inhibition of ALK2 in human HeLa cells assessed as inhibition of SMAD1 phosphorylation
Ligand InfoPC cidPC sid
In DepthDetails PubMed
TargetBone morphogenetic protein receptor type-1A(Homo sapiens (Human))
Incyte
Curated by ChEMBL
LigandPNGBDBM50596223(CHEMBL5200241)
Affinity DataIC50:  161nM. Assay description: Inhibition of ALK3 (unknown origin)
Ligand InfoPC cidPC sid
In DepthDetails PubMed
TargetActivin receptor type-1(Homo sapiens (Human))
Incyte
Curated by ChEMBL
LigandPNGBDBM50596223(CHEMBL5200241)
Affinity DataIC50:  2.90nM. Assay description: Inhibition of ALK2 (unknown origin)
Ligand InfoPC cidPC sid
In DepthDetails PubMed