BDBM50597384 CHEMBL5191017
SMILES Cc1nnc(SC(=O)c2ccc3ccccc3c2)s1
InChI Key InChIKey=ZAKSIAKFNDBWPL-UHFFFAOYSA-N
Data  1 KI  1 IC50
  Tab Delimited (TSV)   2D SDfile   Computed 3D by Vconf -m prep SDfile
Find this compound or compounds like it in BindingDB:
Activity Spreadsheet -- Enzyme Inhibition Constant Data from BindingDB
Found 2 hits for monomerid = 50597384
TargetReplicase polyprotein 1ab(2019-nCoV)
Eberhard Karls University T£Bingen
Curated by ChEMBL
LigandPNGBDBM50597384(CHEMBL5191017)
Affinity DataKi:  21nM. Assay description: Inhibition of recombinant his tagged SARS CoV-2 main protease expressed in Escherichia coli BL21 assessed as inhibition constant using Boc-Abu-Tle-Le...
Ligand InfoPC cidPC sid
In DepthDetails PubMed
TargetReplicase polyprotein 1ab(2019-nCoV)
Eberhard Karls University T£Bingen
Curated by ChEMBL
LigandPNGBDBM50597384(CHEMBL5191017)
Affinity DataIC50:  454nM. Assay description: Inhibition of recombinant his tagged SARS CoV-2 main protease expressed in Escherichia coli BL21 using Boc-Abu-Tle-Leu-Gln-AMC37 as fluorogenic subst...
Ligand InfoPC cidPC sid
In DepthDetails PubMed