BDBM50597540 CHEMBL5201156
SMILES N[C@@H]1C[C@@H]1c1cc(F)c(Br)c(F)c1
InChI Key InChIKey=VEESSMHTAMEHGS-SVGQVSJJSA-N
Data  2 KI
  Tab Delimited (TSV)   2D SDfile   Computed 3D by Vconf -m prep SDfile
Find this compound or compounds like it in BindingDB:
Activity Spreadsheet -- Enzyme Inhibition Constant Data from BindingDB
Found 2 hits for monomerid = 50597540
TargetLysine-specific histone demethylase 1A(Homo sapiens (Human))
Riken Center For Biosystems Dynamics Research
Curated by ChEMBL
LigandPNGBDBM50597540(CHEMBL5201156)
Affinity DataKi:  11nM. Assay description: Inhibition of LSD1 (unknown origin) (172 to 833 residues) expressed in baculovirus-infected Sf9 insect cells using K4-dimethylated H3 as substrate by...
In DepthDetails PubMed
TargetLysine-specific histone demethylase 2(Homo sapiens (Human))
Riken Center For Biosystems Dynamics Research
Curated by ChEMBL
LigandPNGBDBM50597540(CHEMBL5201156)
Affinity DataKi:  7.00E+3nM. Assay description: Inhibition of LSD2 (unknown origin) (26 to 822 residues) expressed in baculovirus-infected Sf9 insect cells using K4-dimethylated H3 as substrate by ...
In DepthDetails PubMed