BDBM50597627 CHEMBL5192465
SMILES COc1ccc(cc1S(N)(=O)=O)-c1nnc(Nc2ccc(cc2)S(N)(=O)=O)c2ccccc12
InChI Key InChIKey=JTNUWRKPBUOECD-UHFFFAOYSA-N
Data  1 KI
  Tab Delimited (TSV)   2D SDfile   Computed 3D by Vconf -m prep SDfile
Find this compound or compounds like it in BindingDB:
Activity Spreadsheet -- Enzyme Inhibition Constant Data from BindingDB
Found 1 hit for monomerid = 50597627
TargetEctonucleotide pyrophosphatase/phosphodiesterase family member 3(Homo sapiens (Human))
University Of Bonn
Curated by ChEMBL
LigandPNGBDBM50597627(CHEMBL5192465)
Affinity DataKi:  1.56E+4nM. Assay description: Inhibition of recombinant human soluble NPP3 expressed in Sf9 insect cells using ATP as substrate measured after 4 hrs by capillary electrophoresis
Ligand InfoPC cidPC sid
In DepthDetails PubMed