BDBM50597642 CHEMBL5182554
SMILES Cc1ccc(cc1-c1nccs1)-c1nnc(Nc2ccc(cc2)S(N)(=O)=O)c2ccccc12
InChI Key InChIKey=QOLXCXJVCNMSMN-UHFFFAOYSA-N
Data  3 KI
  Tab Delimited (TSV)   2D SDfile   Computed 3D by Vconf -m prep SDfile
Find this compound or compounds like it in BindingDB:
Activity Spreadsheet -- Enzyme Inhibition Constant Data from BindingDB
Found 3 hits for monomerid = 50597642
TargetCarbonic anhydrase 9(Homo sapiens (Human))
University Of Bonn
Curated by ChEMBL
LigandPNGBDBM50597642(CHEMBL5182554)
Affinity DataKi:  20nM. Assay description: Inhibition of human carbonic anhydrase 9 incubated for 15 mins prior to testing by phenol red based stopped-flow CO2 hydration assay
Ligand InfoPC cidPC sid
In DepthDetails PubMed
TargetCarbonic anhydrase 2(Homo sapiens (Human))
University Of Bonn
Curated by ChEMBL
LigandPNGBDBM50597642(CHEMBL5182554)
Affinity DataKi:  74nM. Assay description: Inhibition of human carbonic anhydrase 2 incubated for 15 mins prior to testing by phenol red based stopped-flow CO2 hydration assay
Ligand InfoPC cidPC sid
In DepthDetails PubMed
TargetEctonucleotide pyrophosphatase/phosphodiesterase family member 3(Homo sapiens (Human))
University Of Bonn
Curated by ChEMBL
LigandPNGBDBM50597642(CHEMBL5182554)
Affinity DataKi:  2.01E+4nM. Assay description: Inhibition of recombinant human soluble NPP3 expressed in Sf9 insect cells using ATP as substrate measured after 4 hrs by capillary electrophoresis
Ligand InfoPC cidPC sid
In DepthDetails PubMed