BDBM50597908 CHEMBL5181496
SMILES OC1=C(Sc2ccccc2Cl)C(=O)NC(C1)(c1cccc(NC2CCCCC2)n1)c1cccc(Nc2ccc(F)c(F)c2)n1
InChI Key InChIKey=YZBODLLOYFPXDM-UHFFFAOYSA-N
Data  4 IC50
  Tab Delimited (TSV)   2D SDfile   Computed 3D by Vconf -m prep SDfile
Find this compound or compounds like it in BindingDB:
Activity Spreadsheet -- Enzyme Inhibition Constant Data from BindingDB
Found 4 hits for monomerid = 50597908
TargetL-lactate dehydrogenase A chain(Homo sapiens (Human))
Genentech
Curated by ChEMBL
LigandPNGBDBM50597908(CHEMBL5181496)
Affinity DataIC50:  0.900nM. Assay description: Inhibition of LDHA (unknown origin)
Ligand InfoPC cidPC sid
In DepthDetails PubMed
TargetL-lactate dehydrogenase B chain(Homo sapiens (Human))
Genentech
Curated by ChEMBL
LigandPNGBDBM50597908(CHEMBL5181496)
Affinity DataIC50:  2.80nM. Assay description: Inhibition of LDHB (unknown origin)
Ligand InfoPC cidPC sid
In DepthDetails PubMed
TargetL-lactate dehydrogenase B chain(Homo sapiens (Human))
Genentech
Curated by ChEMBL
LigandPNGBDBM50597908(CHEMBL5181496)
Affinity DataIC50:  2.80nM. Assay description: Inhibition of LDHB (unknown origin)
Ligand InfoPC cidPC sid
In DepthDetails PubMed
TargetL-lactate dehydrogenase A chain(Homo sapiens (Human))
Genentech
Curated by ChEMBL
LigandPNGBDBM50597908(CHEMBL5181496)
Affinity DataIC50:  0.900nM. Assay description: Inhibition of LDHA (unknown origin)
Ligand InfoPC cidPC sid
In DepthDetails PubMed