BDBM50598639 CHEMBL5209031
SMILES Fc1cccc(c1)S(=O)(=O)N[C@@H](CCCCNC(=S)NCCc1noc(=O)[nH]1)C(=O)N[C@@H](Cc1c[nH]c2ccccc12)C(=O)NC1CCC1
InChI Key InChIKey=VMXODWQPYCGCPY-SVBPBHIXSA-N
Data  1 KI
  Tab Delimited (TSV)   2D SDfile   Computed 3D by Vconf -m prep SDfile
Find this compound or compounds like it in BindingDB:
Activity Spreadsheet -- Enzyme Inhibition Constant Data from BindingDB
Found 1 hit for monomerid = 50598639
TargetNAD-dependent protein deacylase sirtuin-5, mitochondrial(Homo sapiens (Human))
Sapienza University Of Rome
Curated by ChEMBL
LigandPNGBDBM50598639(CHEMBL5209031)
Affinity DataKi:  7nM. Assay description: Binding affinity to SIRT5 (unknown origin) assessed as deglutarylase activity by measuring inhibition constant
Ligand InfoPC cidPC sid
In DepthDetails PubMed