BDBM50601557 CHEMBL5186770
SMILES OC(=O)C(F)(F)F.OC(=O)C(F)(F)F.CCCCCCNC(=O)\N=C(/N)NCCCc1nnc(N)o1
InChI Key InChIKey=DEUIALJQMNBZOT-UHFFFAOYSA-N
Data  4 KI  4 Kd
  Tab Delimited (TSV)   2D SDfile   Computed 3D by Vconf -m prep SDfile
Find this compound or compounds like it in BindingDB:
Activity Spreadsheet -- Enzyme Inhibition Constant Data from BindingDB
Found 8 hits for monomerid = 50601557
TargetHistamine H2 receptor(Homo sapiens (Human))
University Of Regensburg
Curated by ChEMBL
LigandPNGBDBM50601557(CHEMBL5186770)
Affinity DataKi:  389nM. Assay description: Displacement of [3H]UR-DE257 from human histamine H2 receptor stably expressed in baculovirus infected Sf9 cell membrane co-expressing RG-Salpha S in...
Ligand InfoPC cidPC sid
In DepthDetails PubMed
TargetHistamine H1 receptor(Homo sapiens (Human))
University Of Regensburg
Curated by ChEMBL
LigandPNGBDBM50601557(CHEMBL5186770)
Affinity DataKi:  8.91E+3nM. Assay description: Displacement of [3H] mepyramine from human histamine H1 receptor stably expressed in baculovirus infected Sf9 cell membrane co-expressing RGS4 incuba...
Ligand InfoPC cidPC sid
In DepthDetails PubMed
TargetHistamine H3 receptor(Homo sapiens (Human))
University Of Regensburg
Curated by ChEMBL
LigandPNGBDBM50601557(CHEMBL5186770)
Affinity DataKi: <1.00E+4nM. Assay description: Displacement of [3H]UR-PI294 from human histamine H3 receptor stably expressed in baculovirus infected Sf9 cell membrane co-expressing G-alphai2 and ...
Ligand InfoPC cidPC sid
In DepthDetails PubMed
TargetHistamine H4 receptor(Homo sapiens (Human))
University Of Regensburg
Curated by ChEMBL
LigandPNGBDBM50601557(CHEMBL5186770)
Affinity DataKi: <1.00E+4nM. Assay description: Displacement of [3H]-histamine from human histamine H4 receptor stably expressed in baculovirus infected Sf9 cell membrane co-expressing G-alphai2 an...
Ligand InfoPC cidPC sid
In DepthDetails PubMed
TargetHistamine H4 receptor(Homo sapiens (Human))
University Of Regensburg
Curated by ChEMBL
LigandPNGBDBM50601557(CHEMBL5186770)
Affinity DataKd:  16nM. Assay description: Displacement of [3H]-histamine from human histamine H4 receptor stably expressed in baculovirus infected Sf9 cell membrane co-expressing G-alphai2 an...
Ligand InfoPC cidPC sid
In DepthDetails PubMed
TargetHistamine H1 receptor(Homo sapiens (Human))
University Of Regensburg
Curated by ChEMBL
LigandPNGBDBM50601557(CHEMBL5186770)
Affinity DataKd:  4.5nM. Assay description: Displacement of [3H] mepyramine from human histamine H1 receptor stably expressed in baculovirus infected Sf9 cell membrane co-expressing RGS4 incuba...
Ligand InfoPC cidPC sid
In DepthDetails PubMed
TargetHistamine H2 receptor(Homo sapiens (Human))
University Of Regensburg
Curated by ChEMBL
LigandPNGBDBM50601557(CHEMBL5186770)
Affinity DataKd:  12nM. Assay description: Displacement of [3H]UR-DE257 from human histamine H2 receptor stably expressed in baculovirus infected Sf9 cell membrane co-expressing RG-Salpha S in...
Ligand InfoPC cidPC sid
In DepthDetails PubMed
TargetHistamine H3 receptor(Homo sapiens (Human))
University Of Regensburg
Curated by ChEMBL
LigandPNGBDBM50601557(CHEMBL5186770)
Affinity DataKd:  3nM. Assay description: Displacement of [3H]UR-PI294 from human histamine H3 receptor stably expressed in baculovirus infected Sf9 cell membrane co-expressing G-alphai2 and ...
Ligand InfoPC cidPC sid
In DepthDetails PubMed