BDBM50601579 CHEMBL5202592
SMILES OC(=O)C(F)(F)F.OC(=O)C(F)(F)F.CC(CNC(=O)\N=C(/N)NCCCc1cnc(N)s1)Cc1ccc(C)cc1
InChI Key InChIKey=ZZDDLWVPLCUTER-UHFFFAOYSA-N
Data  6 KI  7 Kd  4 EC50
  Tab Delimited (TSV)   2D SDfile   Computed 3D by Vconf -m prep SDfile
Find this compound or compounds like it in BindingDB:
Activity Spreadsheet -- Enzyme Inhibition Constant Data from BindingDB
Found 17 hits for monomerid = 50601579
TargetHistamine H2 receptor(Homo sapiens (Human))
University Of Regensburg
Curated by ChEMBL
LigandPNGBDBM50601579(CHEMBL5202592)
Affinity DataKi:  65nM. Assay description: Displacement of [3H]UR-DE257 from human histamine H2 receptor stably expressed in baculovirus infected Sf9 cell membrane co-expressing RG-Salpha S in...
Ligand InfoPC cidPC sid
In DepthDetails PubMed
TargetD(3) dopamine receptor(Homo sapiens)
University Of Regensburg
Curated by ChEMBL
LigandPNGBDBM50601579(CHEMBL5202592)
Affinity DataKi:  229nM. Assay description: Displacement of [3H]N-methylspiperone from human D3 receptor stably expressed in HEK293T cells co-expressing luciferase and CEK incubated for 140 min...
Ligand InfoPC cidPC sid
In DepthDetails PubMed
TargetD(2) dopamine receptor(Homo sapiens (Human))
University Of Regensburg
Curated by ChEMBL
LigandPNGBDBM50601579(CHEMBL5202592)
Affinity DataKi:  490nM. Assay description: Displacement of [3H]N-methylspiperone from human D2 long receptor stably expressed in HEK293T cells co-expressing luciferase and CEK incubated for 14...
Ligand InfoPC cidPC sid
In DepthDetails PubMed
TargetHistamine H1 receptor(Homo sapiens (Human))
University Of Regensburg
Curated by ChEMBL
LigandPNGBDBM50601579(CHEMBL5202592)
Affinity DataKi:  2.51E+3nM. Assay description: Displacement of [3H] mepyramine from human histamine H1 receptor stably expressed in baculovirus infected Sf9 cell membrane co-expressing RGS4 incuba...
Ligand InfoPC cidPC sid
In DepthDetails PubMed
TargetHistamine H4 receptor(Homo sapiens (Human))
University Of Regensburg
Curated by ChEMBL
LigandPNGBDBM50601579(CHEMBL5202592)
Affinity DataKi:  4.47E+3nM. Assay description: Displacement of [3H]-histamine from human histamine H4 receptor stably expressed in baculovirus infected Sf9 cell membrane co-expressing G-alphai2 an...
Ligand InfoPC cidPC sid
In DepthDetails PubMed
TargetHistamine H3 receptor(Homo sapiens (Human))
University Of Regensburg
Curated by ChEMBL
LigandPNGBDBM50601579(CHEMBL5202592)
Affinity DataKi:  4.79E+3nM. Assay description: Displacement of [3H]UR-PI294 from human histamine H3 receptor stably expressed in baculovirus infected Sf9 cell membrane co-expressing G-alphai2 and ...
Ligand InfoPC cidPC sid
In DepthDetails PubMed
TargetHistamine H2 receptor(Homo sapiens (Human))
University Of Regensburg
Curated by ChEMBL
LigandPNGBDBM50601579(CHEMBL5202592)
Affinity DataEC50:  234nM. Assay description: Agonist activity at human histamine H2 receptor stably expressed in HEK293T cells co-expressing ARRB2 incubated for 60 mins by beta-arrestin2 recruit...
Ligand InfoPC cidPC sid
In DepthDetails PubMed
TargetHistamine H2 receptor(Homo sapiens (Human))
University Of Regensburg
Curated by ChEMBL
LigandPNGBDBM50601579(CHEMBL5202592)
Affinity DataEC50:  78nM. Assay description: Agonist activity at human histamine H2 receptor stably expressed in HEK293T cells co-expressing NlucN-mGs/hH2R-NlucC assessed as induction of mini-Gi...
Ligand InfoPC cidPC sid
In DepthDetails PubMed
TargetD(2) dopamine receptor(Homo sapiens (Human))
University Of Regensburg
Curated by ChEMBL
LigandPNGBDBM50601579(CHEMBL5202592)
Affinity DataEC50:  4.47E+3nM. Assay description: Agonist activity at human D2 long receptor stably expressed in HEK293T cells co-expressing ElucN-betaarr2 hD2longR-ElucC by beta-arrestin2 recruitmen...
Ligand InfoPC cidPC sid
In DepthDetails PubMed
TargetD(3) dopamine receptor(Homo sapiens)
University Of Regensburg
Curated by ChEMBL
LigandPNGBDBM50601579(CHEMBL5202592)
Affinity DataEC50:  1.05E+3nM. Assay description: Agonist activity at human D3 receptor stably expressed in HEK293T cells co-expressing ElucN-betaarr2 hD3R-ElucC by beta-arrestin2 recruitment assay
Ligand InfoPC cidPC sid
In DepthDetails PubMed
TargetD(3) dopamine receptor(Homo sapiens)
University Of Regensburg
Curated by ChEMBL
LigandPNGBDBM50601579(CHEMBL5202592)
Affinity DataKd:  0.0258nM. Assay description: Displacement of [3H]N-methylspiperone from human D3 receptor stably expressed in HEK293T cells co-expressing luciferase and CEK incubated for 140 min...
Ligand InfoPC cidPC sid
In DepthDetails PubMed
TargetD(2) dopamine receptor(Homo sapiens (Human))
University Of Regensburg
Curated by ChEMBL
LigandPNGBDBM50601579(CHEMBL5202592)
Affinity DataKd:  0.0149nM. Assay description: Displacement of [3H]N-methylspiperone from human D2 long receptor stably expressed in HEK293T cells co-expressing luciferase and CEK at high concentr...
Ligand InfoPC cidPC sid
In DepthDetails PubMed
TargetD(2) dopamine receptor(Homo sapiens (Human))
University Of Regensburg
Curated by ChEMBL
LigandPNGBDBM50601579(CHEMBL5202592)
Affinity DataKd:  0.0149nM. Assay description: Displacement of [3H]N-methylspiperone from human D2 long receptor stably expressed in HEK293T cells co-expressing luciferase and CEK incubated for 14...
Ligand InfoPC cidPC sid
In DepthDetails PubMed
TargetHistamine H4 receptor(Homo sapiens (Human))
University Of Regensburg
Curated by ChEMBL
LigandPNGBDBM50601579(CHEMBL5202592)
Affinity DataKd:  16nM. Assay description: Displacement of [3H]-histamine from human histamine H4 receptor stably expressed in baculovirus infected Sf9 cell membrane co-expressing G-alphai2 an...
Ligand InfoPC cidPC sid
In DepthDetails PubMed
TargetHistamine H3 receptor(Homo sapiens (Human))
University Of Regensburg
Curated by ChEMBL
LigandPNGBDBM50601579(CHEMBL5202592)
Affinity DataKd:  3nM. Assay description: Displacement of [3H]UR-PI294 from human histamine H3 receptor stably expressed in baculovirus infected Sf9 cell membrane co-expressing G-alphai2 and ...
Ligand InfoPC cidPC sid
In DepthDetails PubMed
TargetHistamine H1 receptor(Homo sapiens (Human))
University Of Regensburg
Curated by ChEMBL
LigandPNGBDBM50601579(CHEMBL5202592)
Affinity DataKd:  4.5nM. Assay description: Displacement of [3H] mepyramine from human histamine H1 receptor stably expressed in baculovirus infected Sf9 cell membrane co-expressing RGS4 incuba...
Ligand InfoPC cidPC sid
In DepthDetails PubMed
TargetHistamine H2 receptor(Homo sapiens (Human))
University Of Regensburg
Curated by ChEMBL
LigandPNGBDBM50601579(CHEMBL5202592)
Affinity DataKd:  12nM. Assay description: Displacement of [3H]UR-DE257 from human histamine H2 receptor stably expressed in baculovirus infected Sf9 cell membrane co-expressing RG-Salpha S in...
Ligand InfoPC cidPC sid
In DepthDetails PubMed