BDBM50605602 CHEMBL5175277
SMILES OC(=O)Cc1ccc(O)cc1Nc1c(Cl)cccc1Cl
InChI Key InChIKey=CFUMXZGGBYQFQS-UHFFFAOYSA-N
Data  4 KI
  Tab Delimited (TSV)   2D SDfile   Computed 3D by Vconf -m prep SDfile
Find this compound or compounds like it in BindingDB:
Activity Spreadsheet -- Enzyme Inhibition Constant Data from BindingDB
Found 4 hits for monomerid = 50605602
TargetCalcium/calmodulin-dependent protein kinase type II subunit alpha(Rattus norvegicus (rat))
University Of Copenhagen
Curated by ChEMBL
LigandPNGBDBM50605602(CHEMBL5175277)
Affinity DataKi:  22nM. Assay description: Displacement of [3H]HOCPCA from CaMK2alpha in rat brain cerebral cortex membrane homogenates assessed as inhibition constant measured after 60 mins b...
Ligand InfoPC cidPC sid
In DepthDetails PubMed
TargetCalcium/calmodulin-dependent protein kinase type II subunit alpha(Homo sapiens (Human))
University Of Copenhagen
Curated by ChEMBL
LigandPNGBDBM50605602(CHEMBL5175277)
Affinity DataKi:  35nM. Assay description: Inhibition of [3H]NCS-382 binding to CaMK2alpha (unknown origin)
Ligand InfoPC cidPC sid
In DepthDetails PubMed
TargetCalcium/calmodulin-dependent protein kinase type II subunit alpha(Rattus norvegicus (rat))
University Of Copenhagen
Curated by ChEMBL
LigandPNGBDBM50605602(CHEMBL5175277)
Affinity DataKi:  35nM. Assay description: Displacement of [3H]NCS-382 from CaMK2alpha in rat brain cerebral cortex membrane homogenates assessed as inhibition constant measured after 60 mins ...
Ligand InfoPC cidPC sid
In DepthDetails PubMed
TargetCalcium/calmodulin-dependent protein kinase type II subunit alpha(Homo sapiens (Human))
University Of Copenhagen
Curated by ChEMBL
LigandPNGBDBM50605602(CHEMBL5175277)
Affinity DataKi:  800nM. Assay description: Displacement of [3H]HOCPCA from recombinant full length CaMK2alpha (unknown origin) expressed in HEK293 cell homogenates assessed as inhibition const...
Ligand InfoPC cidPC sid
In DepthDetails PubMed