BDBM50605683 CHEMBL5180827
SMILES Oc1cc(ccc1F)C(=O)N1CCC(Cc2cccc(Oc3ccc(cn3)C(F)(F)F)c2)CC1
InChI Key InChIKey=ZCQFHORTRABIGN-UHFFFAOYSA-N
Data  2 IC50
  Tab Delimited (TSV)   2D SDfile   Computed 3D by Vconf -m prep SDfile
Find this compound or compounds like it in BindingDB:
Activity Spreadsheet -- Enzyme Inhibition Constant Data from BindingDB
Found 2 hits for monomerid = 50605683
TargetFatty-acid amide hydrolase 1(Homo sapiens (Human))
University Of Pisa
Curated by ChEMBL
LigandPNGBDBM50605683(CHEMBL5180827)
Affinity DataIC50: >1.00E+4nM. Assay description: Inhibition of human recombinant FAAH using AMC arachidonoyl amide as substrate incubated for 30 mins by fluorescence based assay
Ligand InfoPC cidPC sid
In DepthDetails PubMed
TargetMonoglyceride lipase(Homo sapiens (Human))
University Of Pisa
Curated by ChEMBL
LigandPNGBDBM50605683(CHEMBL5180827)
Affinity DataIC50:  86nM. Assay description: Inhibition of human recombinant MAGL using 4-nitrophenylacetate as substrate incubated for 30 mins by microplate reader method
Ligand InfoPC cidPC sid
In DepthDetails PubMed