BDBM50607118 CHEMBL5219065
SMILES OS(=O)(=O)CC(=O)Nc1nc2cc(ccc2s1)[N+]([O-])=O
InChI Key InChIKey=VXGRFTFAHKVNIL-UHFFFAOYSA-N
Data  1 IC50
  Tab Delimited (TSV)   2D SDfile   Computed 3D by Vconf -m prep SDfile
Find this compound or compounds like it in BindingDB:
Activity Spreadsheet -- Enzyme Inhibition Constant Data from BindingDB
Found 1 hit for monomerid = 50607118
TargetLow molecular weight phosphotyrosine protein phosphatase(Homo sapiens (Human))
Eli Lilly
Curated by ChEMBL
LigandPNGBDBM50607118(CHEMBL5219065)
Affinity DataIC50:  400nM. Assay description: Inhibition of His-tagged human LMW-PTP expressed in Escherichia coli BL21 using pNPP as substrate incubated for 10 mins by microplate reader based sp...
Ligand InfoPC cidPC sid
In DepthDetails PubMed