BDBM50993 (6E)-5-azanylidene-3-methylsulfanyl-6-[(6-oxidanyl-4-oxidanylidene-chromen-3-yl)methylidene]-[1,2,4]thiadiazolo[4,5-a]pyrimidin-7-one::(6E)-6-[(6-hydroxy-4-keto-chromen-3-yl)methylene]-5-imino-3-(methylthio)-[1,2,4]thiadiazolo[4,5-a]pyrimidin-7-one::(6E)-6-[(6-hydroxy-4-oxo-1-benzopyran-3-yl)methylidene]-5-imino-3-(methylthio)-[1,2,4]thiadiazolo[4,5-a]pyrimidin-7-one::(6E)-6-[(6-hydroxy-4-oxochromen-3-yl)methylidene]-5-imino-3-methylsulfanyl-[1,2,4]thiadiazolo[4,5-a]pyrimidin-7-one::6-[1-(6-Hydroxy-4-oxo-4H-chromen-3-yl)-meth-(E)-ylidene]-5-imino-3-methylsulfanyl-5,6-dihydro-[1,2,4]thiadiazolo[4,5-a]pyrimidin-7-one::MLS000332055::SMR000221507::cid_1945566
SMILES CSC1=NSC2=NC(=O)\C(=C\c3coc4ccc(O)cc4c3=O)C(=N)N12
InChI Key InChIKey=VNZMZLDNBWPPON-IHXPMUQKSA-N
Data  2 IC50  4 EC50
  Tab Delimited (TSV)   2D SDfile   Computed 3D by Vconf -m prep SDfile
Find this compound or compounds like it in BindingDB:
Activity Spreadsheet -- Enzyme Inhibition Constant Data from BindingDB
Found 6 hits for monomerid = 50993
TargetGlycoprotein 42(Human herpesvirus 4 type 2)
Emory University
Curated by PubChem BioAssay
LigandPNGBDBM50993((6E)-5-azanylidene-3-methylsulfanyl-6-[(6-oxidanyl...)
Affinity DataIC50:  2.24E+3nM. Assay description: NIH Molecular Libraries Screening Centers Network [MLSCN] Emory Chemical Biology Discovery Center in MLSCN Assay provider: Theodore Jardetzky; Northw...
In DepthDetails PCBioAssay
TargetInsulin-degrading enzyme(Homo sapiens (Human))
The Scripps Research Institute Molecular Screening Center
Curated by PubChem BioAssay
LigandPNGBDBM50993((6E)-5-azanylidene-3-methylsulfanyl-6-[(6-oxidanyl...)
Affinity DataIC50: >6.21E+3nM. Assay description: Source (MLPCN Center Name): The Scripps Research Institute Molecular Screening Center (SRIMSC) Center Affiliation: The Scripps Research Institute (TS...
In DepthDetails PCBioAssay
TargetIntestinal-type alkaline phosphatase 1(Rattus norvegicus (Rat))
Burnham Center For Chemical Genomics
Curated by PubChem BioAssay
LigandPNGBDBM50993((6E)-5-azanylidene-3-methylsulfanyl-6-[(6-oxidanyl...)
Affinity DataEC50:  2.08E+4nM. Assay description: Data Source: Sanford-Burnham Center for Chemical Genomics (SBCCG) Source Affiliation: Sanford-Burnham Medical Research Institute (SBMRI, San Diego, C...
In DepthDetails PCBioAssay
TargetAlkaline phosphatase, germ cell type(Homo sapiens (Human))
Burnham Center For Chemical Genomics
Curated by PubChem BioAssay
LigandPNGBDBM50993((6E)-5-azanylidene-3-methylsulfanyl-6-[(6-oxidanyl...)
Affinity DataEC50:  2.72E+4nM. Assay description: Data Source: Sanford-Burnham Center for Chemical Genomics (SBCCG) Source Affiliation: Sanford-Burnham Medical Research Institute (SBMRI, San Diego, C...
In DepthDetails PCBioAssay
TargetAlkaline phosphatase, tissue-nonspecific isozyme(Homo sapiens (Human))
Burnham Center For Chemical Genomics
Curated by PubChem BioAssay
LigandPNGBDBM50993((6E)-5-azanylidene-3-methylsulfanyl-6-[(6-oxidanyl...)
Affinity DataEC50:  3.02E+4nM. Assay description: Data Source: Sanford-Burnham Center for Chemical Genomics (SBCCG) Source Affiliation: Sanford-Burnham Medical Research Institute (SBMRI, San Diego, C...
In DepthDetails PCBioAssay
TargetIntestinal-type alkaline phosphatase(Homo sapiens (Human))
Burnham Center For Chemical Genomics
Curated by PubChem BioAssay
LigandPNGBDBM50993((6E)-5-azanylidene-3-methylsulfanyl-6-[(6-oxidanyl...)
Affinity DataEC50:  2.49E+4nM. Assay description: Data Source: Sanford-Burnham Center for Chemical Genomics (SBCCG) Source Affiliation: Sanford-Burnham Medical Research Institute (SBMRI, San Diego, C...
In DepthDetails PCBioAssay