BDBM517666 NY0617::US11124489, Compound 10
SMILES CC(C)(C)c1ccc(cc1)-c1cc(no1)C(=O)C(NNc1ccc(Cl)c(c1)C(F)(F)F)C#N
InChI Key InChIKey=NTLDUEZPBDVZJM-UHFFFAOYSA-N
Data  2 IC50
  Tab Delimited (TSV)   2D SDfile   Computed 3D by Vconf -m prep SDfile
Find this compound or compounds like it in BindingDB:
Activity Spreadsheet -- Enzyme Inhibition Constant Data from BindingDB
Found 2 hits for monomerid = 517666
TargetRap guanine nucleotide exchange factor 4(Homo sapiens (Human))
Board of Regents, The University of Texas System
US Patent
LigandPNGBDBM517666(NY0617 | US11124489, Compound 10)
Affinity DataIC50:  2.20E+3nM. Assay description: From the biological results discussed above, compounds 10, 14-15, 23-24, 26-27, and 31-32 were identified as potent EPAC1 inhibitors with IC50 values...
Ligand InfoPC cidPC sid
In DepthDetails US Patent
TargetRap guanine nucleotide exchange factor 3(Homo sapiens (Human))
Board of Regents, The University of Texas System
US Patent
LigandPNGBDBM517666(NY0617 | US11124489, Compound 10)
Affinity DataIC50:  7.30E+3nM. Assay description: To explore the SARs and examine how the modifications on the isoxazole ring affect biological activities of newly synthesized analogues, we first eva...
Ligand InfoPC cidPC sid
In DepthDetails US Patent