BDBM517841 Preparation of N-(2-((2-(dimethylamino)ethyl)(methyl)amino)-5-((4-(4-fluoro-1-isopropyl-2-methyl-1H-benzo[d]imidazole-6-yl)pyrimidin-2-yl)amino)-4-(2,2,2-trifluoroethoxy)phenyl)acrylamide::US11111233, Example 49
SMILES CC(C)n1c(C)nc2c(F)cc(cc12)-c1ccnc(Nc2cc(NC(=O)C=C)c(cc2OCC(F)(F)F)N(C)CCN(C)C)n1
InChI Key InChIKey=UWVPSNZNTASYGN-UHFFFAOYSA-N
Data  2 IC50
  Tab Delimited (TSV)   2D SDfile   Computed 3D by Vconf -m prep SDfile
Find this compound or compounds like it in BindingDB:
Activity Spreadsheet -- Enzyme Inhibition Constant Data from BindingDB
Found 2 hits for monomerid = 517841
TargetEpidermal growth factor receptor [T790M,L858R](Homo sapiens (Human))
Shenzhen Targetrx
US Patent
LigandPNGBDBM517841(Preparation of N-(2-((2-(dimethylamino)ethyl)(meth...)
Affinity DataIC50: <1nM. Assay description: Reagents and Materials:WT EGFR (Carna, Cat. No. 08-115), EGFR [L858R] (Carna, Cat. No. 08-502), EGFR [L858R/T790M] (Carna, Cat. No. 08-510), ATP (Sig...
Ligand InfoPC cidPC sid
In DepthDetails US Patent
TargetEpidermal growth factor receptor(Homo sapiens (Human))
Shenzhen Targetrx
US Patent
LigandPNGBDBM517841(Preparation of N-(2-((2-(dimethylamino)ethyl)(meth...)
Affinity DataIC50: <1nM. Assay description: Reagents and Materials:WT EGFR (Carna, Cat. No. 08-115), EGFR [L858R] (Carna, Cat. No. 08-502), EGFR [L858R/T790M] (Carna, Cat. No. 08-510), ATP (Sig...
Ligand InfoPC cidPC sid
In DepthDetails US Patent